Furniture Sector Ontology
type: Ontology
description: funStep© is a repository of information, products, services and knowledge, in the furniture and related industries, encouraging and facilitating the adoption of ISO 10303-236, a modular approach by dividing the entire information model into reusable components, each defined in a separate application module (AM). The furniture sector ontology, as part of the funStep initiative, covers the wood and furniture domain, providing a common vocabulary. It is based on the domain knowledge from experts, and supported by furniture cluster regulations, articles and interviews. Main resources covered by this ontology are products and services (including logistics to support negotiation for transportation), processes and techniques, machines, equipment and facilities.
license: Licensed by a BSD 3-Clause License and its use requires permission which can be requested at: https://www.aidimme.es/@contacto.
comment: The Furniture Sector Ontology (FSO) leaded by AIDIMME (www.aidimme.es) under funStep© initiative (www.funstep.org).
version info: version 3.0

hasCode
type: AnnotationProperty
range: CodeType
type: ObjectProperty
domain: CodeList
comment: Propiedad que indica un código específico. @es
comment: Property denoting a particular code.

hasCodeList
type: AnnotationProperty
comment: Property denoting a list of codes.
comment: Propiedad que indica una lista de códigos. @es

hasUnitList
type: AnnotationProperty
comment: Property denoting a list of units.
comment: Propiedad que indica una lista de unidades. @es

Air load
type: ObjectProperty
sub property of: CodeProperty
type: FunctionalProperty
domain: Air transport
range: CodeType
has code list: AirLoadList
label: Carga aérea @es

Material
type: ObjectProperty
sub property of: CodeProperty
type: FunctionalProperty
domain: Beam
range: CodeType
has code list: BeamMaterialList

Cardboard type
type: ObjectProperty
sub property of: CodeProperty
type: FunctionalProperty
domain: Cardboard boxes
range: CodeType
has code list: CardboardTypeList
label: Tipo de cartón @es

Wave type
type: ObjectProperty
sub property of: CodeProperty
type: FunctionalProperty
domain: Cardboard boxes
range: CodeType
has code list: CardboardWaveTypeList
label: Tipo de onda @es

Material
type: ObjectProperty
sub property of: CodeProperty
type: FunctionalProperty
domain: Containers
range: CodeType
has code list: ContainerMaterialList

Type
type: ObjectProperty
sub property of: CodeProperty
type: FunctionalProperty
domain: Containers
range: CodeType
has code list: ContainerTypeList
label: Tipo @es

Material
type: ObjectProperty
sub property of: CodeProperty
type: FunctionalProperty
domain: Corner pieces
range: CodeType
has code list: CornerPieceMaterialList

Shape
type: ObjectProperty
sub property of: CodeProperty
type: FunctionalProperty
domain: Corner pieces
range: CodeType
has code list: CornerPieceShapeList
label: Forma @es

Customs management
type: ObjectProperty
sub property of: CodeProperty
type: FunctionalProperty
domain: Customs management
range: CodeType
has code list: CustomsManagementServiceList
label: Gestión aduanera @es

Destination
type: ObjectProperty
sub property of: CodeProperty
type: FunctionalProperty
domain: Transport
range: CodeType
has code list: TransportPlaceList
label: Destino @es

Employs
type: ObjectProperty
inverse of: Employed by
type: InverseFunctionalProperty
domain: Machines
range: Techniques
comment: Hacer uso de algo. @es
comment: Make use of something.
label: Utiliza @es

FEFCO classification
type: ObjectProperty
sub property of: CodeProperty
type: FunctionalProperty
domain: Cardboard boxes
range: CodeType
has code list: FefcoClassificationList
comment: El código FEFCO es un código internacional para distinguir entre distintos tipos de cartón. Está diseñado para ser comprendido en todo el mundo y ser utilizado en transacciones comerciales. Los fabricantes deben cumplir criterios específicos de modo que sus cajas de cartón sean clasificadas dentro de una u otra categoría FEFCO. @es
comment: The FEFCO code is an international code to differentiate between different cardboard types. It is design to be understandable around the world and used in commercial transactions. Manufacturers should fulfill specific criteria in order its boxes to be classified in one or another FEFCO category.
label: Clasificación FEFCO @es

Material
type: ObjectProperty
sub property of: CodeProperty
type: FunctionalProperty
domain: Floorings and coatings
range: CodeType
has code list: FlooringAndCoatingMaterialList

Adherence
type: ObjectProperty
sub property of: QuantityProperty
type: FunctionalProperty
domain: Chemical substances
range: QuantityType
has unit list: AdherenceUnitList
comment: La adhesión es la propiedad de la materia por la cual se unen y plasman dos superficies de sustancias iguales o diferentes al entrar en contancto, manteniéndose juntas por fuerzas intermoleculares. En este contexto se trata de la adhesión que presenta una determinada substancia, como una pintura o un barniz, respecto al medio en el que se aplica. @es
comment: The adhesion is the tendency of dissimilar particles or surfaces to cling to one another. In this context, the focus is on the adhesion of some substance, such as paint or varnish, related to the surface where this is applied.
label: Adherencia @es

Bar increments
type: ObjectProperty
sub property of: QuantityProperty
type: FunctionalProperty
domain: Industrial protection elements
range: QuantityType
has unit list: LengthUnitList
comment: Esta propiedad representa los incrementos de barra en elementos de protección como barreras de seguridad. @es
comment: This property represents the bar increments in industrial protection elements like security barriers.
label: Incrementos de barra @es

Has base
type: ObjectProperty
domain: Pieces of furniture
range: Bases
label: Tiene base @es

Has catalogue
type: ObjectProperty
domain: Organization
range: Catalogue
label: Tiene catálogo @es

Contact person
type: ObjectProperty
domain: Organization
range: Contact person
label: Persona de contacto @es

Density
type: ObjectProperty
sub property of: QuantityProperty
type: FunctionalProperty
range: QuantityType
has unit list: DensityUnitList
comment: La densidad de un material se define como la masa de material por unidad de volumen, y esta a menudo varía en función de la temperatura y la presión. Se designa con el símbolo ρ. @es
comment: The density of a material is defined as material mass per unit volume and this usually varies with the temperature and pressure. It is designated by the symbol ρ.
label: Densidad @es

Has desk
type: ObjectProperty
type: FunctionalProperty
domain: Compact beds
range: Home student desks
label: Tiene escritorio @es

Diameter
type: ObjectProperty
sub property of: QuantityProperty
type: FunctionalProperty
domain: Basic assembly hardware
range: QuantityType
has unit list: LengthUnitList
comment: Esta propiedad representa el diámetro de piezas de herraje como tuercas, arandelas y tornillos entre otros. @es
comment: This property represents the diameter of fitting pieces such as nuts, washers and screws among others.
label: Diámetro @es

Has door frame
type: ObjectProperty
type: FunctionalProperty
domain: Doors
range: Door frames
label: Tiene marco de puerta @es

Ecolabel type II (self-declaration): Other
type: ObjectProperty
sub property of: FileProperty
type: FunctionalProperty
domain: Class
  union of: Assembly hardware
  union of: Auxiliary equipment
  union of: Building elements
  union of: Chemical substances
  union of: Components
  union of: Furniture
  union of: Home textiles
  union of: Household appliances
  union of: Machines
  union of: Lighting
  union of: Materials
  union of: Musical instruments
  union of: Outdoor equipment
  union of: Tertiary packaging
label: Ecoetiquetado tipo II (autodeclaración): Otros @es

Estimated delivery time
type: ObjectProperty
sub property of: QuantityProperty
type: FunctionalProperty
domain: Products
range: QuantityType
has unit list: DeliveryTimeUnitList
is visible: false
comment: El tiempo estimado de entrega del producto. @es
comment: The estimated delivery time of the product.
label: Tiempo estimado de entrega @es

Gloss
type: ObjectProperty
sub property of: QuantityProperty
type: FunctionalProperty
domain: Class
  union of: Paints
  union of: Varnishes
range: QuantityType
has unit list: GlossUnitList
comment: The brillo es una propiedad óptica que indica lo bien que una superficie refleja la luz en una dirección especular (a modo de espejo). Es un parámetro importante para describir el aspecto visual de una pieza. @es
comment: The gloss is an optical property which indicates how well a surface reflects light in a specular (mirror-like) direction. It is an important parameter to describe the visual appearance of an item.
label: Brillo @es

Guarantee period
type: ObjectProperty
sub property of: QuantityProperty
type: FunctionalProperty
domain: Class
  union of: Products
  union of: Services
range: QuantityType
has unit list: GuaranteePeriodUnitList
is visible: false
comment: El tiempo durante el cual el productos o servicio debe funcionar correctamente y cumplir con las expectativas de calidad. @es
comment: The time during which the product or service must function properly and meet the quality expectations.
label: Período de la garantía @es

Has headboard
type: ObjectProperty
domain: Beds
range: Headboards
label: Tiene cabecero @es

Height
type: ObjectProperty
sub property of: QuantityProperty
type: FunctionalProperty
domain: Class
  union of: Auxiliary equipment
  union of: Components
  union of: Furniture accessories
  union of: Home textiles
  union of: Machines
  union of: Materials
  union of: Pieces of furniture
range: QuantityType
has unit list: HeightUnitList
is visible: false
comment: Altura del elemento. El orden estándar para indicar las dimensiones de un elemento son: Longitud (L) x Anchura (W) x Altura (H). @es
comment: Height of the element. The standard order when defining the dimensions of an object is: Length (L) x Width (W) x Height (H).
label: Altura @es

Impact zone
type: ObjectProperty
sub property of: QuantityProperty
domain: Industrial protection elements
range: QuantityType
has unit list: LengthUnitList
comment: Esta propiedad representa la zona de impacto en elementos de protección como barreras de seguridad. @es
comment: This property represents the impact zone in industrial protection elements like security barriers.
label: Zona de impacto @es

Length
type: ObjectProperty
sub property of: QuantityProperty
type: FunctionalProperty
domain: Class
  union of: Assembly complements
  union of: Auxiliary equipment
  union of: Components
  union of: Furniture accessories
  union of: Home textiles
  union of: Machines
  union of: Materials
  union of: Nuts
  union of: Pieces of furniture
  union of: Screws
  union of: Washers
range: QuantityType
has unit list: LengthUnitList
is visible: false
comment: Length of the element. The standard order when defining the dimensions of an object is: Length (L) x Width (W) x Height (H).
comment: Longitud del elemento. El orden estándar para indicar las dimensiones de un elemento son: Longitud (L) x Anchura (W) x Altura (H). @es
label: Longitud @es

Low emission of volatile organic compounds
type: ObjectProperty
sub property of: FileProperty
type: FunctionalProperty
domain: Class
  union of: Assembly hardware
  union of: Auxiliary equipment
  union of: Building elements
  union of: Chemical substances
  union of: Components
  union of: Furniture
  union of: Home textiles
  union of: Lighting
  union of: Materials
  union of: Musical instruments
  union of: Outdoor equipment
  union of: Tertiary packaging
label: Baja emisión de compuestos orgánicos volátiles @es

Has material
type: ObjectProperty
domain: Class
  union of: Components
  union of: Products
range: Materials
label: Tiene material @es

Has mattress
type: ObjectProperty
domain: Class
  union of: Beds
  union of: Sofas
range: Mattresses
label: Tiene colchón @es

Maximum load power
type: ObjectProperty
sub property of: QuantityProperty
type: FunctionalProperty
domain: Industrial protection elements
range: QuantityType
has unit list: Energy
comment: Esta propiedad representa la energía máxima de carga en elementos de protección como barreras de seguridad. @es
comment: This property represents the maximum load power in industrial protection elements like security barriers.
label: Energía máxima de carga @es

Max. recommended weight
type: ObjectProperty
sub property of: QuantityProperty
type: FunctionalProperty
domain: Class
  union of: Beds
  union of: Children furniture
  union of: Drawers
  union of: Mattresses
  union of: Seats
  union of: Seat parts
  union of: Storage pieces of furniture
range: QuantityType
has unit list: WeightUnitList
comment: El peso máximo que el producto puede soportar de forma segura. @es
comment: The maximum weight that can be safely supported by the product.
label: Máximo peso recomendado @es

Has mirror
type: ObjectProperty
domain: Class
  union of: Bathroom cabinets
  union of: Chests of drawers
  union of: Cupboards
  union of: Dressers
range: Mirrors
label: Tiene espejo @es

Has mirror frame
type: ObjectProperty
type: FunctionalProperty
domain: Mirrors
range: Mirror frames
label: Tiene marco de espejo @es

Has part
type: ObjectProperty
domain: Pieces of furniture
range: Components
label: Tiene parte @es

Post diameter
type: ObjectProperty
sub property of: QuantityProperty
type: FunctionalProperty
domain: Industrial protection elements
range: QuantityType
has unit list: LengthUnitList
comment: Esta propiedad representa el diámetro del poste en elementos de protección como barreras de seguridad. @es
comment: This property represents the diameter of the post in industrial protection elements like security barriers.
label: Diámetro del poste @es

Price
type: ObjectProperty
type: FunctionalProperty
domain: Class
  union of: Products
  union of: Services
range: Price
is visible: false
label: Precio @es

Product
type: ObjectProperty
domain: Catalogue
range: Class
  union of: Components
  union of: Products
label: Producto @es

Rail diameter
type: ObjectProperty
sub property of: QuantityProperty
type: FunctionalProperty
domain: Industrial protection elements
range: QuantityType
has unit list: LengthUnitList
comment: Esta propiedad representa el diámetro del rail en elementos de protección como barreras de seguridad. @es
comment: This property represents the diameter of the rail in industrial protection elements like security barriers.
label: Diámetro del rail @es

Resistivity
type: ObjectProperty
sub property of: QuantityProperty
type: FunctionalProperty
domain: Chemical substances
range: QuantityType
has unit list: ResistivityUnitList
comment: La resistividad eléctrica - y su opuesta, la conductividad eléctrica - es una propiedad fundamental de los materiales que mide lo fuerte que se resiste al flujo de corriente eléctrica o la conduce. Una baja resistividad indica que el material permite fácilmente el flujo de corriente eléctrica. @es
comment: The electrical resistivity - and its converse, the electrical conductivity - is a fundamental property of a material that quantifies how strongly it resists or conducts the flow of electric current. A low resistivity indicates a material that readily allows the flow of electric current.
label: Resistividad @es

Seat height
type: ObjectProperty
sub property of: QuantityProperty
type: FunctionalProperty
domain: Seats
range: QuantityType
has unit list: HeightUnitList
comment: La altura del asiento. @es
comment: The height of the seat.
label: Altura del asiento @es

Seat part
type: ObjectProperty
domain: Class
  union of: High chairs
  union of: Seats
range: Seat parts
comment: En este caso "asiento" es usado como la parte concreta de un mueble donde la persona se sienta. @es
comment: Here "seat" is used in the sense of the particular part of a piece of furniture on which one rests in sitting.
label: Asiento @es

Style
type: ObjectProperty
sub property of: CodeProperty
type: FunctionalProperty
domain: Class
  union of: Furniture accessories
  union of: Pieces of furniture
range: CodeType
has code list: StyleList
comment: A kind or sort especially in regard to appearance and form, eg "modern style" or "Roman style".
label: Estilo @es

Has supplier
type: ObjectProperty
domain: Manufacturer
range: Supplier
label: Tiene proveedor @es

Technical datasheet
type: ObjectProperty
sub property of: FileProperty
type: FunctionalProperty
domain: Products
label: Ficha técnica @es

Thickness
type: ObjectProperty
sub property of: QuantityProperty
type: FunctionalProperty
domain: Wooden materials
range: QuantityType
has unit list: LengthUnitList
comment: La cualidad o grado de espesor. La distancia entre dos superficies. @es
comment: The quality or degree of being thick. The distance between two surfaces.
label: Espesor @es
alternative label: Grosor @es

Use
type: ObjectProperty
sub property of: CodeProperty
type: FunctionalProperty
domain: Class
  union of: Assembly hardware
  union of: Chemical substances
  union of: Components
  union of: Furniture accessories
  union of: Home textiles
  union of: Household appliances
  union of: Materials
  union of: Pieces of furniture
range: CodeType
has code list: UseList
label: Uso @es
alternative label: Destination
alternative label: Destino @es

Vertical surface
type: ObjectProperty
domain: Class
  union of: Furniture accessories
  union of: Pieces of furniture
range: Vertical surfaces
label: Superficie vertical @es

Viscosity
type: ObjectProperty
sub property of: QuantityProperty
type: FunctionalProperty
domain: Chemical substances
range: QuantityType
has unit list: ViscosityUnitList
comment: La viscosidad de una fluido mide su resistencia a la deformación gradual por esfuerzo cortante o tensión de tracción. En el caso de líquidos, corresponde normalmente al concepto informal de espesor. @es
comment: The viscosity of a fluid measures its resistance to gradual deformation by shear stress or tensile stress. For liquids, it usually corresponds to the informal concept of thickness.
label: Viscosidad @es

Has wardrobe
type: ObjectProperty
type: FunctionalProperty
domain: Compact beds
range: Wardrobes
label: Tiene armario @es

Weight
type: ObjectProperty
sub property of: QuantityProperty
type: FunctionalProperty
domain: Class
  union of: Assembly hardware
  union of: Auxiliary equipment
  union of: Chemical substances
  union of: Components
  union of: Furniture accessories
  union of: Home textiles
  union of: Machines
  union of: Pieces of furniture
range: QuantityType
has unit list: WeightUnitList
is visible: false
comment: Peso del elemento. @es
comment: Weight of the element.
label: Peso @es

Width
type: ObjectProperty
sub property of: QuantityProperty
type: FunctionalProperty
domain: Class
  union of: Auxiliary equipment
  union of: Components
  union of: Furniture accessories
  union of: Home textiles
  union of: Machines
  union of: Materials
  union of: Pieces of furniture
range: QuantityType
has unit list: WidthUnitList
is visible: false
comment: Anchura del elemento. En el caso de tuercas, corresponde a su grosor. El orden estándar para indicar las dimensiones de un elemento son: Longitud (L) x Anchura (W) x Altura (H). @es
comment: Width of the element. In the case of nuts, this corresponds to its Thickness. The standard order when defining the dimensions of an object is: Length (L) x Width (W) x Height (H).
label: Anchura @es

Has window frame
type: ObjectProperty
type: FunctionalProperty
domain: Windows
range: Window frames
label: Tiene marco de ventana @es

In-house services
type: ObjectProperty
sub property of: CodeProperty
type: FunctionalProperty
domain: In-house services
range: CodeType
has code list: InHouseServiceList
label: Servicios in-house @es

Industry specialization
type: ObjectProperty
sub property of: CodeProperty
type: FunctionalProperty
domain: Logistics services
range: CodeType
has code list: IndustrySpecializationList
label: Especialización industrial @es

Is composed by
type: ObjectProperty
domain: Furniture compositions
range: Class
  union of: Components
  union of: Furniture accessories
  union of: Home textiles
  union of: Pieces of furniture
comment: A composition is composed by several furniture items.
comment: Una composición está formada por varios elementos de mobiliario. @es
label: Está compuesta por @es

Employed by
type: ObjectProperty
type: FunctionalProperty
domain: Techniques
range: Machines
label: Utilizado por @es

Manufactured by
type: ObjectProperty
inverse of: Manufactures
type: FunctionalProperty
domain: Class
  union of: Components
  union of: Furniture
range: Manufacturer
is visible: false
label: Fabricado por @es

Performed by
type: ObjectProperty
inverse of: Performs
type: FunctionalProperty
domain: Processes
range: Machines
label: Realizado por @es

Upholstered in
type: ObjectProperty
type: FunctionalProperty
range: Upholstery materials
label: Tapizado en @es

Logistics consultancy
type: ObjectProperty
sub property of: CodeProperty
type: FunctionalProperty
domain: Logistics consultancy
range: CodeType
has code list: LogisticsConsultancyServiceList
label: Consultoría logística @es

Managed product type
type: ObjectProperty
sub property of: CodeProperty
type: FunctionalProperty
domain: Logistics services
range: CodeType
has code list: ManagedProductTypeList
label: Tipo de producto @es

Manufactures
type: ObjectProperty
type: InverseFunctionalProperty
domain: Manufacturer
range: Class
  union of: Components
  union of: Furniture
label: Fabrica @es

Maritime load
type: ObjectProperty
sub property of: CodeProperty
type: FunctionalProperty
domain: Maritime transport
range: CodeType
has code list: MaritimeLoadList
label: Carga marítima @es

Order picking
type: ObjectProperty
sub property of: CodeProperty
type: FunctionalProperty
domain: Order picking
range: CodeType
has code list: OrderPickingServiceList
label: Recogida de pedido @es

Origin
type: ObjectProperty
sub property of: CodeProperty
type: FunctionalProperty
domain: Transport
range: CodeType
has code list: TransportPlaceList
label: Origen @es

Dimensions
type: ObjectProperty
sub property of: CodeProperty
type: FunctionalProperty
domain: Class
  union of: Box-pallets
  union of: Pallets
range: CodeType
has code list: PalletDimensionsList
label: Dimensiones @es

Flat
type: ObjectProperty
sub property of: CodeProperty
type: FunctionalProperty
domain: Pallets
range: CodeType
has code list: PalletFlatTypeList
label: Piso @es

Material
type: ObjectProperty
sub property of: CodeProperty
type: FunctionalProperty
domain: Pallets
range: CodeType
has code list: PalletMaterialList

Performs
type: ObjectProperty
type: InverseFunctionalProperty
domain: Machines
range: Processes
label: Realiza @es

Material
type: ObjectProperty
sub property of: CodeProperty
type: FunctionalProperty
domain: Protective plates
range: CodeType
has code list: ProtectivePlateMaterialList

Rail load
type: ObjectProperty
sub property of: CodeProperty
type: FunctionalProperty
domain: Rail transport
range: CodeType
has code list: RailLoadList
label: Carga ferroviaria @es

Reverse logistics
type: ObjectProperty
sub property of: CodeProperty
type: FunctionalProperty
domain: Reverse logistics
range: CodeType
has code list: ReverseLogisticsServiceList
label: Logística inversa @es

Shipment type
type: ObjectProperty
sub property of: CodeProperty
type: FunctionalProperty
domain: Road transport
range: CodeType
has code list: ShipmentTypeList
label: Tipo de envío @es

Truck load
type: ObjectProperty
sub property of: CodeProperty
type: FunctionalProperty
domain: Road transport
range: CodeType
has code list: TruckLoadList
label: Carga del camión @es

Warehousing
type: ObjectProperty
sub property of: CodeProperty
type: FunctionalProperty
domain: Warehousing
range: CodeType
has code list: WarehousingServiceList
label: Almacenaje @es

CodeProperty
type: ObjectProperty
type: FunctionalProperty
comment: Property denoting coded values, linking/containing code values. CodeProperty is a FunctionalProperty and indicates that the property may specify :hasCode and :hasCodeList.
comment: Propiedad que indica los valores de código, enlazando/conteniendo estos valores. CodeProperty es una FunctionalProperty que indica que la propiedad debe ser especificada mediante :hasCode y :hasCodeList. @es

FileProperty
type: ObjectProperty
type: FunctionalProperty
comment: Property allowing the file attachment.
comment: Propiedad que permite la posibilidad de adjuntar ficheros. @es

QuantityProperty
type: ObjectProperty
type: FunctionalProperty
comment: Property denoting a quantity, containing / linking valid unit codes.
comment: Propiedad que indica una cantidad, enlazando/conteniendo códigos de unidad válidos. @es

Company department
type: DatatypeProperty
domain: Contact person
range: string
label: Departamento al que pertenece @es

Wood species
type: DatatypeProperty
domain: Wooden materials
range: string
label: Especie(s) de madera @es

Complies with legislation
type: DatatypeProperty
domain: Class
  union of: Components
  union of: Products
  union of: Services
range: string
is visible: false
comment: Esta propiedad hace referencia a aquellas leyes que afectan al sector madera y mueble que cumple el producto. Estas leyes pueden estar relacionadas con aspectos de calidad, medidas preventivas, el uso de determinadas substancias y materiales, así como condiciones de seguridad durante el proceso de producción. @es
comment: This property refers to those laws affecting the wood and furniture cluster which are met by the product. In the current scope, this makes reference to laws related to the furniture industry, such as quality, preventive measures and considerations about the use of specific substances and materials as well as safety conditions during the productions processes.
label: Cumple con legislación @es

Complies with regulation
type: DatatypeProperty
domain: Class
  union of: Components
  union of: Products
  union of: Services
range: string
is visible: false
comment: Esta propiedad hace referencia a aquellas normas del sector madera y mueble que cumple el producto. Las normas son básicamente el modo en que los reguladores aplican la legislación cumpliendo los requerimientos que ésta establece. En la industria, las regulaciones especifican los requirimientos formales especificos que han de seguir las organizaciones y los trabajadores. Las normas normalmente están relacionadas con la seguridad de los productos, la protección del consumidor y otros factores de interés general. Pueden ser desarrolladas interna o externamente pues pueden desarrollarse mediante especificaciones técnicas o estándares en el sector privado. @es
comment: This property refers to those norms affecting the wood and furniture cluster which are met by the product. The norms are basically the way the legislation is enforced by regulators supporting the requirements of the legislation. In industry, the regulations specify the particular formal requirements needed to be followed by organizations, workers and employers. Regulations usually address product safety, consumer protection and other factors in public interest. They could either be internally or externally developed so they may be developed through technical specifications or some standards in the private sector.
label: Cumple con normativa @es

Address
type: DatatypeProperty
domain: Organization
range: string
label: Dirección @es

Adjustable height
type: DatatypeProperty
type: FunctionalProperty
domain: Class
  union of: Chairs
  union of: Cradles
  union of: High chairs
  union of: Stools
  union of: Tables
range: boolean
label: Regulable en altura @es

Application method
type: DatatypeProperty
type: FunctionalProperty
domain: Chemical substances
range: string
comment: El método de aplicación es la manera en que la substancia se aplica al material, (p.e.: inmersión, electroestática, rotomoldeo, etc.). @es
comment: The application method is the way the substance is applied to the material, (i.e.: immersion, electroestatic, rotomoulding, etc.).
label: Método de aplicación @es

Awards
type: DatatypeProperty
domain: Organization
range: string
comment: Descripción de los premios que ha obtenido la empresa. @es
comment: Description of the awards obtained by the company.
label: Premios @es

Has backrest
type: DatatypeProperty
type: FunctionalProperty
domain: Class
  union of: Benches
  union of: Stools
range: boolean
label: Tiene respaldo @es

Business activity code
type: DatatypeProperty
domain: Organization
range: string
comment: El Código de Actividad identifica la actividad económica de la empresa. En España, se utilizan habitualmente los códigos CNAE para esta identificación. Existen otros códigos de identificación, como el IRS. @es
comment: The Business Activity Code identifies the economic activity of the company. In Spain, CNAE codes are usually used for this identification. There are other identification codes such as IRS.
label: Código de actividad @es

Has capacity
type: DatatypeProperty
type: FunctionalProperty
domain: Class
  union of: Beds
  union of: Seats
range: int
label: Tiene capacidad @es

Catalogue name
type: DatatypeProperty
type: FunctionalProperty
domain: Catalogue
range: string
label: Nombre del catálogo @es

Coating description
type: DatatypeProperty
type: FunctionalProperty
domain: Class
  union of: Building timber
  union of: Wood veneers
  union of: Wooden boards
range: string
comment: Descripción del material utilizado para recubrir productos, tales como tableros, tablones de madera y otros elementos. @es
comment: Description of the material used for the coating of some products such as wood boards, timber planks, and other items.
label: Descripción del recubrimiento @es

Code
type: DatatypeProperty
type: FunctionalProperty
domain: Class
  union of: Components
  union of: Products
range: string
label: Código @es

Colour
type: DatatypeProperty
domain: Class
  union of: Components
  union of: Materials
  union of: Products
range: string
label: Color @es

Company name
type: DatatypeProperty
type: FunctionalProperty
domain: Organization
range: string
label: Nombre de la empresa @es

Composition
type: DatatypeProperty
type: FunctionalProperty
domain: Class
  union of: Chemical substances
  union of: Materials
range: string
comment: Composición del material o la substancia. @es
comment: Composition of the material or substance.
label: Composición @es

Contact person
type: DatatypeProperty
type: FunctionalProperty
domain: Contact person
range: string
label: Persona de contacto @es

Content of pentachlorophenol
type: DatatypeProperty
type: FunctionalProperty
domain: Wooden materials
range: int
comment: Percentage (%) of content of pentachlorophenol (PCP)
comment: Porcentaje (%) de contenido de pentaclorofenol (PCP) @es
label: Contenido de pentaclorofenol @es

Currency
type: DatatypeProperty
type: FunctionalProperty
domain: Price
range: string
label: Moneda @es

Description
type: DatatypeProperty
type: FunctionalProperty
domain: Class
  union of: Components
  union of: Materials
  union of: Processes
  union of: Products
  union of: Services
  union of: Techniques
range: string
is visible: false
label: Descripción @es

Description of materials
type: DatatypeProperty
type: FunctionalProperty
domain: Class
  union of: Components
  union of: Products
range: string
comment: Descripción de los materiales de los que está elaborado un producto (i.e.: hierro, aluminio, madera, vidrio, etc.). @es
comment: Description of the materials that makes up the product (i.e.: iron, aluminium, wood, glass, etc.).
label: Descripción de materiales @es

Drive type
type: DatatypeProperty
type: FunctionalProperty
domain: Screws
range: string
comment: La ranura hace referencia a la hendidura del cabezal del tornillo que se utiliza para girarlo. Algunos tipos de ranuras son: ranurada (cabeza plana), phillips (cruceta), cuadrada, y pozidriv. @es
comment: The driver refers to the indented shape on the screw head used to turn the screw. Some drive types are: slotted (flathead), phillips (crosshead), square, and pozidriv.
label: Tipo de ranura @es

EAN code
type: DatatypeProperty
type: FunctionalProperty
domain: Products
range: string
comment: El sistema de códigos de barras European Article Number (EAN) o International Article Number (IAN) se utiliza para identificar productos y está adoptado por más de cien países y cerca de un millón de empresas. El código EAN más usual es EAN13, constituido por 13 dígitos y con una estructura dividida en 4 partes: código del país, código de empresa, código de producto y dígito de control. @es
comment: The bar code system European Article Number (EAN) or International Article Number (IAN) is used to identofy products and it is adopted by more than one hundred countries and nearly a million companies. The most used EAN code is EAN13, formed by 13 dígits following a structure divided into 4 parts: country code, company code, product code and check dígit.
label: Código EAN @es

Ecolabel type II (self-declaration): Low energy consumption
type: DatatypeProperty
type: FunctionalProperty
domain: Class
  union of: Furniture accessories
  union of: Household appliances
  union of: Machines
  union of: Lighting
  union of: Musical instruments
range: string
label: Ecoetiquetado tipo II (autodeclaración): Bajo consumo energético @es

Ecolabel type II (self-declaration): Material of renewable origin
type: DatatypeProperty
type: FunctionalProperty
domain: Class
  union of: Assembly hardware
  union of: Auxiliary equipment
  union of: Auxiliary materials
  union of: Building elements
  union of: Ceramics materials
  union of: Chemical substances
  union of: Components
  union of: Composite material
  union of: Furniture
  union of: Home textiles
  union of: Laminated coating materials
  union of: Lighting
  union of: Lignocellulosic materials
  union of: Musical instruments
  union of: Outdoor equipment
  union of: Plastic materials
  union of: Tertiary packaging
  union of: Upholstery materials
  union of: Wooden materials
range: int
comment: Se representa como porcentaje (%) @es
comment: This is represented as a percentage (%)
label: Ecoetiquetado tipo II (autodeclaración): Material de origen renovable @es

Ecolabel type II (self-declaration): Recyclable
type: DatatypeProperty
type: FunctionalProperty
domain: Class
  union of: Assembly hardware
  union of: Auxiliary equipment
  union of: Building elements
  union of: Components
  union of: Furniture
  union of: Home textiles
  union of: Household appliances
  union of: Machines
  union of: Lighting
  union of: Materials
  union of: Musical instruments
  union of: Outdoor equipment
  union of: Tertiary packaging
range: boolean
label: Ecoetiquetado tipo II (autodeclaración): Reciclable @es

Ecolabel type II (self-declaration): Recycled content
type: DatatypeProperty
type: FunctionalProperty
domain: Class
  union of: Assembly hardware
  union of: Auxiliary equipment
  union of: Building elements
  union of: Chemical substances
  union of: Components
  union of: Furniture
  union of: Home textiles
  union of: Household appliances
  union of: Lighting
  union of: Materials
  union of: Musical instruments
  union of: Outdoor equipment
  union of: Tertiary packaging
range: int
comment: Se representa como porcentaje (%) @es
comment: This is represented as a percentage (%)
label: Ecoetiquetado tipo II (autodeclaración): Contenido reciclado @es

E-mail
type: DatatypeProperty
domain: Class
  union of: Contact person
  union of: Organization
range: string
label: Correo electrónico @es

Electrophoretic coated base
type: DatatypeProperty
type: FunctionalProperty
domain: Industrial protection elements
range: boolean
label: Soporte de recubrimiento electroforético @es

Environmental functions (e.g.: decontamination)
type: DatatypeProperty
type: FunctionalProperty
domain: Class
  union of: Building envelope
  union of: Chemical substances
  union of: Floorings and coatings
  union of: Household appliances
  union of: Machines
  union of: Materials
  union of: Musical instruments
  union of: Tile
range: string
label: Funciones ambientales (p.e.: descontaminación) @es

EPAL certificate
type: DatatypeProperty
type: FunctionalProperty
domain: Class
  union of: Containers
  union of: Pallets
range: boolean
label: Certificado EPAL @es

Family name
type: DatatypeProperty
type: FunctionalProperty
domain: Contact person
range: string
label: Apellido(s) @es
alternative label: Second name

First name
type: DatatypeProperty
type: FunctionalProperty
domain: Contact person
range: string
label: Nombre @es

Flap
type: DatatypeProperty
type: FunctionalProperty
domain: Pallets
range: boolean
label: Aleta @es

Folding doors
type: DatatypeProperty
type: FunctionalProperty
domain: Containers
range: boolean
label: Puertas abatibles @es

Has folding side
type: DatatypeProperty
type: FunctionalProperty
domain: Class
  union of: Cradles
  union of: Cribs
  union of: Playpens
range: boolean
label: Tiene lateral abatible @es

Free sample
type: DatatypeProperty
type: FunctionalProperty
domain: Class
  union of: Assembly hardware
  union of: Chemical substances
  union of: Materials
range: boolean
comment: Esta propiedad indica si la empresa ofrece o no muestras gratuitas del producto. @es
comment: This property indicates if the company offers or not free samples of the product.
label: Muestra gratuita @es

Guarantee conditions
type: DatatypeProperty
type: FunctionalProperty
domain: Class
  union of: Products
  union of: Services
range: string
is visible: false
label: Condiciones de la garantía @es

Head type
type: DatatypeProperty
type: FunctionalProperty
domain: Screws
range: string
comment: El tipo/forma del cabezal de un elemento estilo tornillo. Los valores más comunes son: plano, ovalado, redondo, troncocónica, lenteja y botón. @es
comment: The type/shape of the head of a screw-like element. Most common values are: flat, oval, round, pan, truss and button.
label: Tipo de cabezal @es

Headquarters in countries
type: DatatypeProperty
type: FunctionalProperty
domain: Organization
range: string
label: Sede en países @es

Interior construction
type: DatatypeProperty
type: FunctionalProperty
domain: Containers
range: boolean
label: Acondicionamiento interior @es

ISPM-15 certificate
type: DatatypeProperty
type: FunctionalProperty
domain: Class
  union of: Containers
  union of: Pallets
range: boolean
comment: ISPM-15 is the International Standard For Phytosanitary Measures No. 15 that regulates the wood packaging used in international trade and describes the phytosanitary measures to reduce the risk of pests related to wood packaging.
comment: NIMF-15 es la Norma Internacional para Medidas Fitosanitarias número 15 que regula el embalaje de madera en el comercio internacional y describe las medidas fitosanitarias para reducir el riesgo de plagas relacionadas con el embalaje de madera. @es
label: Certificado NIMF-15 @es

Issue date
type: DatatypeProperty
type: FunctionalProperty
domain: Catalogue
range: string
label: Fecha de emisión @es

Job title
type: DatatypeProperty
domain: Contact person
range: string
label: Cargo en la empresa @es
alternative label: Job position

Moisture content
type: DatatypeProperty
type: FunctionalProperty
domain: Class
  union of: Chemical substances
  union of: Building timber
  union of: Wood veneers
  union of: Wooden boards
range: int
comment: Percentage (%) of moisture in content.
comment: Porcentaje (%) de humedad en el contenido. @es
label: Porcentaje de humedad @es

Name
type: DatatypeProperty
type: FunctionalProperty
domain: Class
  union of: Components
  union of: Products
  union of: Services
range: string
is visible: false
label: Nombre @es

Number of armrests
type: DatatypeProperty
type: FunctionalProperty
domain: Class
  union of: Benches
  union of: Seats
range: int
label: Número de brazos @es

Number of beds
type: DatatypeProperty
type: FunctionalProperty
domain: Beds
range: int
label: Número de camas @es

Number of castors
type: DatatypeProperty
type: FunctionalProperty
domain: Class
  union of: Chairs
  union of: Chests of drawers
  union of: Chests of drawers with babybath
  union of: Children furniture
  union of: Containers
  union of: Sofas
  union of: Stools
  union of: Tables
range: int
label: Número de ruedas @es

Number of doors
type: DatatypeProperty
type: FunctionalProperty
domain: Cabinets
range: int
label: Número de puertas @es

Number of drawers
type: DatatypeProperty
type: FunctionalProperty
domain: Class
  union of: Storage pieces of furniture
  union of: Tables
range: int
label: Número de cajones @es

Number of handles
type: DatatypeProperty
type: FunctionalProperty
domain: Class
  union of: Doors
  union of: Storage pieces of furniture
range: int
label: Número de tiradores @es

Number of legs
type: DatatypeProperty
type: FunctionalProperty
domain: Pieces of furniture
range: int
label: Número de patas @es

Price granularity
type: DatatypeProperty
type: FunctionalProperty
domain: Price
range: string
label: Precio granulado @es

Price
type: DatatypeProperty
type: FunctionalProperty
domain: Price
range: float
label: Precio @es

Reclining system
type: DatatypeProperty
type: FunctionalProperty
domain: Class
  union of: Chairs
  union of: Sofas
range: boolean
label: Reclinable @es

Recycled content
type: DatatypeProperty
type: FunctionalProperty
domain: Class
  union of: Components
  union of: Materials
  union of: Products
range: float
label: Contenido reciclado @es

Removable cover
type: DatatypeProperty
type: FunctionalProperty
domain: Mattresses
range: boolean
label: Funda extraíble @es

Seat belt
type: DatatypeProperty
type: FunctionalProperty
domain: Class
  union of: Baby prams
  union of: High chairs
range: boolean
label: Cinturón de seguridad @es

Skate
type: DatatypeProperty
type: FunctionalProperty
domain: Class
  union of: Containers
  union of: Pallets
range: boolean
label: Patín @es

Spare parts available
type: DatatypeProperty
type: FunctionalProperty
domain: Class
  union of: Auxiliary equipment
  union of: Furniture
  union of: Household appliances
  union of: Machines
  union of: Lighting
  union of: Musical instruments
  union of: Outdoor equipment
range: boolean
label: Piezas de repuesto disponibles @es

Special effects
type: DatatypeProperty
type: FunctionalProperty
domain: Materials
range: string
label: Efectos especiales @es

Base of substance
type: DatatypeProperty
type: FunctionalProperty
domain: Class
  union of: Paints
  union of: Varnishes
range: string
comment: Esta propiedad indica cuál es la base de una sustancia, como una pintura o un barniz. Algunos valores son: polipropileno, poliestireno, ABS y metacrilato. @es
comment: This property indicates the base of a substance such as paint and varnish. Some values are: polypropylene, polystyrene, ABS and methacrylate.
label: Base de la substancia @es

Technical specifications
type: DatatypeProperty
domain: Class
  union of: Components
  union of: Products
range: string
label: Especificaciones técnicas @es

Telefax
type: DatatypeProperty
domain: Organization
range: string

Telephone
type: DatatypeProperty
domain: Class
  union of: Contact person
  union of: Organization
range: string
label: Teléfono @es

Units per pack
type: DatatypeProperty
domain: Assembly hardware
range: int
label: Unidades por envase @es

VAT identifier
type: DatatypeProperty
type: FunctionalProperty
domain: Organization
range: string
comment: Unique number used to identify a company for taxation purposes.
label: Identificador VAT @es

Website
type: DatatypeProperty
domain: Organization
range: string
label: Página web @es

Certifications
type: DatatypeProperty
domain: Class
  union of: Components
  union of: Materials
  union of: Organization
  union of: Products
  union of: Services
range: string
is visible: false
comment: Certifications are documents that prove that a product, service, system, process, person or company complies with the requirements established in a specific regulation. To obtain these documents, a certification process, which is usually a documental process, is needed. In the current scope, this process usually also involves a carousel of tests, trials and analysis to assess the compliance with the established requirements.
comment: Las certificaciones son documentos que prueban que un producto, servicio, sistema, proceso, persona, o empresa cumplen los requerimientos establecidos para una norma determinada. Para obtener estos documentos se requiere de un proceso de cerfificación que es normalmente es un proceso documental. En este ámbito, este proceso suele implicar una serie de ensayos, pruebas, y análisis para evaluar la conformidad respecto a los requerimientos establecidos. @es
label: Certificaciones @es

Anti-mosquito
type: DatatypeProperty
type: FunctionalProperty
domain: Chemical substances
range: boolean
label: Antimosquitos @es

Antibacterial
type: DatatypeProperty
type: FunctionalProperty
domain: Class
  union of: Chemical substances
  union of: Mattresses
range: boolean
label: Antibacteriano @es

Breathable
type: DatatypeProperty
type: FunctionalProperty
domain: Class
  union of: Home textiles
  union of: Mattresses
range: boolean
label: Transpirable @es

Co-sleeping convertible
type: DatatypeProperty
type: FunctionalProperty
domain: Cradles
range: boolean
label: Convertible en colecho @es

Coated
type: DatatypeProperty
type: FunctionalProperty
domain: Class
  union of: Wood veneers
  union of: Wooden boards
range: boolean
comment: Los tableros de madera pueden estar revestidos (p.e.: melamina) o crudos. @es
comment: Wooden boards can be coated (i.e.: melamine) or raw.
label: Revestido @es

Type of coating
type: DatatypeProperty
domain: Class
  union of: Wood veneers
  union of: Wooden boards
range: string
comment: Material del que se encuentra revestido el tablero de madera (p.e.: melamina). @es
comment: Material used for the coating of the wood board (i.e.: melamine).
label: Tipo de revestimiento @es

Contract channel
type: DatatypeProperty
type: FunctionalProperty
domain: Class
  union of: Components
  union of: Furniture
  union of: Home textiles
  union of: Household appliances
range: boolean
label: Canal contract @es

Curved
type: DatatypeProperty
type: FunctionalProperty
domain: Class
  union of: Beam
  union of: Benches
  union of: Chairs
  union of: Tables
range: boolean
label: Curvado @es

Designed by
type: DatatypeProperty
domain: Class
  union of: Components
  union of: Products
range: string
label: Diseñado por @es

Easy to repair
type: DatatypeProperty
type: FunctionalProperty
domain: Class
  union of: Components
  union of: Materials
  union of: Products
range: boolean
label: Fácil de reparar @es

Electrical
type: DatatypeProperty
type: FunctionalProperty
domain: Class
  union of: Latches
  union of: Toothbrushes
  union of: Towel racks
range: boolean
label: Eléctrico @es

Fireproof
type: DatatypeProperty
type: FunctionalProperty
domain: Materials
range: boolean
label: Ignífugo @es

Foldable
type: DatatypeProperty
type: FunctionalProperty
domain: Class
  union of: Box-pallets
  union of: Containers
  union of: Furniture accessories
  union of: Pieces of furniture
range: boolean
label: Plegable @es

Home channel
type: DatatypeProperty
type: FunctionalProperty
domain: Class
  union of: Components
  union of: Furniture
  union of: Home textiles
  union of: Household appliances
range: boolean
label: Canal hogar @es

Hygiene sealed
type: DatatypeProperty
type: FunctionalProperty
domain: Industrial protection elements
range: boolean
label: Sellado higiénico @es

Machine washable
type: DatatypeProperty
type: FunctionalProperty
domain: Home textiles
range: boolean
label: Lavable en lavadora @es

Magnetic
type: DatatypeProperty
type: FunctionalProperty
domain: Paints
range: boolean
label: Magnética @es

Nut type
type: DatatypeProperty
type: FunctionalProperty
domain: Nuts
range: string
comment: Algunos tipos comunes de tuerca son: hex, jam, wing, cap, acorn, flange, tee, square, kep, coupling, slotted y castle entre otros. @es
comment: Some common types of nuts are: hex, jam, wing, cap, acorn, flange, tee, square, kep, coupling, slotted and castle among others.
label: Tipo de tuerca @es

Phosphorescent
type: DatatypeProperty
type: FunctionalProperty
domain: Paints
range: boolean
label: Fosforescente @es

Reused
type: DatatypeProperty
type: FunctionalProperty
domain: Class
  union of: Components
  union of: Products
range: boolean
label: Reutilizado @es

Reversible
type: DatatypeProperty
type: FunctionalProperty
domain: Pallets
range: boolean

Rollable
type: DatatypeProperty
type: FunctionalProperty
domain: Mosquito nets
range: boolean
label: Enrollable @es

Second hand
type: DatatypeProperty
type: FunctionalProperty
domain: Class
  union of: Components
  union of: Products
range: boolean
label: Segunda mano @es

Solvent-based
type: DatatypeProperty
type: FunctionalProperty
range: boolean
label: Base disolvente @es

Stackable
type: DatatypeProperty
type: FunctionalProperty
domain: Class
  union of: Box-pallets
  union of: Containers
  union of: Furniture accessories
  union of: Pieces of furniture
range: boolean
label: Apilable @es

Upholstered
type: DatatypeProperty
type: FunctionalProperty
domain: Class
  union of: Bunks
  union of: Chairs
  union of: Sofas
  union of: Stools
range: boolean
comment: Whatever of the pieces of furniture that are covered with a fabric and has a soft material between the fabric and the structure.
label: Tapizado @es

Washer type
type: DatatypeProperty
type: FunctionalProperty
domain: Washers
range: string
comment: Hay distintos tipos de arandela, como flat, fender, finishing, split lock, external or internal tooth lock, square, dock, ogee y sealing entre otros. @es
comment: There are different kinds of washers, such as flat, fender, finishing, split lock, external or internal tooth lock, square, dock, ogee and sealing among others.
label: Tipo de arandela @es

Water-based
type: DatatypeProperty
type: FunctionalProperty
range: boolean
label: Base agua @es

Waterproof
type: DatatypeProperty
type: FunctionalProperty
domain: Class
  union of: Chemical substances
  union of: Materials
range: boolean
label: Hidrófugo @es

Made in
type: DatatypeProperty
domain: Class
  union of: Assembly hardware
  union of: Auxiliary equipment
  union of: Components
  union of: Furniture
  union of: Furniture accessories
  union of: Machines
range: string
label: Fabricado en @es

Abaca fibre
type: Class
subclass of: Natural fibre
label: Fibra de abacá @es

Sandpapers / Abrasives
type: Class
subclass of: Material supplier
label: Lijas / Abrasivos @es

Accessories
type: Class
subclass of: Manufacturer
label: Complementos @es

Acrylic fabric
type: Class
subclass of: Synthetic fabric
label: Tejido acrílico @es

ABS (acrylonitrile butadiene styrene)
type: Class
subclass of: Elastomer plastics
disjoint with: Rubber
label: ABS (acrilonitrilo butadieno estireno) @es

ABS film
type: Class
subclass of: Laminated coating materials
label: Lámina de ABS @es
alternative label: Acrylonitrile butadiene styrene film

Adhesives
type: Class
subclass of: Chemical substances
label: Adhesivos @es

Adhesive tape
type: Class
subclass of: Mixed use accessories
comment: A tape with an adhesive on one side that is used to join things or bind things.
label: Cinta adhesiva @es

Glues / Adhesives
type: Class
subclass of: Material supplier
label: Colas / Adhesivos @es

Aerographic application robot
type: Class
equivalent class: Restriction
  on property: Employs
  some values from: Spraying application
subclass of: Automatic machines
label: Robot de aplicación aerográfico @es

Aerographic brushes
type: Class
subclass of: Tools
label: Cepillos aerográficos @es

Air beds
type: Class
equivalent class: Restriction
  on property: Has mattress
  some values from: Air mattresses
subclass of: Beds
comment: A bed that uses an air-inflated mattress, sometimes connected to an electric air pump and having firmness controls.
label: Camas de aire @es

Air cushions
type: Class
subclass of: Protective bags
comment: A type of packaging material made of paper, acting as a small air cushion, designed to protect items during shipping and storage.
comment: Un tipo de material de embalaje hecho de papel a modo de pequeño colchón de aire, diseñado para proteger los objetos durante el envío y el almacenamiento. @es
label: Almohadas de aire @es

Air fryers
type: Class
subclass of: Household appliances
comment: An electrical device for cooking food by circulating hot air around it at high speed.
label: Freidoras de aire @es

Air mattresses
type: Class
subclass of: Mattresses
comment: A mattress, usually of plastic or rubber, that can be inflated for use, as in camping, and deflated for storage.
label: Colchones de aire @es
alternative label: Airbeds

Air stapler
type: Class
subclass of: Manual machines
label: Grapadora de aire @es

Air transport
type: Class
subclass of: Transport
comment: A service for of taking goods or people from one place to another in an aeroplane.
label: Transporte aéreo @es

Airless application gun
type: Class
subclass of: Spray application gun
label: Pistola de aplicación airless @es

Airmix application gun
type: Class
subclass of: Spray application gun
label: Pistola de aplicación airmix @es

Altars
type: Class
subclass of: Religious tables
comment: An altar is any structure upon which sacrifices or other offerings are offered for religious purposes, or some other sacred place where ceremonies take place.
label: Altares @es

Aluminium
type: Class
subclass of: Metal materials
comment: A silvery white metal, flexible, hard, light, malleable and corrosion-resistant.
label: Aluminio @es

Angular horizontal rip saw
type: Class
subclass of: Automatic machines
label: Seccionadora horizontal angular @es

Angular roll forming machine
type: Class
subclass of: Semi-automatic machines
label: Perfiladora angular @es

Aprons
type: Class
subclass of: Kitchen textiles
comment: A garment of cloth, leather, etc. worn over the front part of the body, usually to protect the clothes.
label: Delantales @es

Architects
type: Class
subclass of: Service provider
label: Arquitectos @es

Armrests
type: Class
subclass of: Components
comment: A rest for the arm.
label: Reposabrazos @es

Assembly
type: Class
subclass of: Processes
comment: The action or process of fitting together the parts of something.
label: Montaje @es

Assembly complements
type: Class
subclass of: Basic assembly hardware
comment: A small piece (plastic and metallic) used in the assembly of furniture items, such as supports, bolts, covers, plugs and caps among others.
label: Complementos de unión @es

Assembly hardware
type: Class
subclass of: Components
subclass of: Restriction
  on property: Units per pack
  some values from: int
comment: An element used to assemble parts.
label: Elementos de unión @es

Automatic cutting machine
type: Class
subclass of: Automatic machines
label: Cortadora automática @es

Automatic lathe
type: Class
subclass of: Automatic machines
label: Torno automático @es

Automatic machines
type: Class
subclass of: Machines
label: Máquinas automáticas @es

Automatic polisher
type: Class
subclass of: Automatic machines
label: Pulidora automática @es

Automatic press for drawers assembly
type: Class
subclass of: Automatic machines
label: Prensa automática para montaje de cajones @es

Automatic press for module assembly
type: Class
subclass of: Automatic machines
label: Prensa automática para montaje de módulos @es

Automatic stacker machine
type: Class
subclass of: Automatic machines
label: Apliladora automática @es

Automatic vertical foam cutting machine
type: Class
subclass of: Automatic machines
label: Máquina automática vertical de corte de espuma @es

Auxiliary equipment
type: Class
subclass of: Products
comment: A machine or device that assist or supplement the main production equipment.
label: Equipamiento industrial auxiliar @es

Auxiliary furniture
type: Class
subclass of: Pieces of furniture
comment: A piece of furniture designed for a complementary use.
label: Mueble auxiliar @es
alternative label: Occasional furniture

Auxiliary materials
type: Class
subclass of: Materials
label: Materiales auxiliares @es

Auxiliary substances
type: Class
subclass of: Chemical substances
label: Substancias auxiliares @es

Baby bath tubs
type: Class
subclass of: Children furniture
comment: A specially designed container used for bathing infants and young children.
label: Bañeras para bebés @es
alternative label: Bañeras infantiles @es

Baby bouncers
type: Class
subclass of: Children furniture
comment: A type of baby gear designed to provide a safe and comfortable place for infants to rest and play.
label: Hamaquitas @es

Baby prams
type: Class
subclass of: Children furniture
comment: A vehicle designed for the carriage of 1 or more children and which can be pushed or steered manually.
label: Cochecitos @es

Backrests
type: Class
subclass of: Components
comment: A rest for the back.
label: Respaldos @es

Band knife machine
type: Class
subclass of: Semi-automatic machines
label: Sierra de cinta para corte de espuma @es

Band sawing machine
type: Class
subclass of: Semi-automatic machines
label: Sierra de cinta @es

Banjos
type: Class
subclass of: Stringed instruments
comment: A stringed musical instrument with a long neck (usually fretted) and a circular drumlike body overlaid with parchment, plucked with the fingers or a plectrum.

Barber chairs
type: Class
subclass of: Professional chairs
comment: A chair used by barbers, adjustable in height and having an adjustable headrest, back, and footrest.
label: Sillones de peluquería @es

Barn doors
type: Class
subclass of: Doors
comment: A door on a barn. It is often/always found on barns, and because of a barn's immense size (often) doors are subsequently big for utility.
label: Puertas de granero @es

Barrier cleaners
type: Class
subclass of: Industrial protection elements
label: Limpiadores de barrera @es

Bases
type: Class
subclass of: Components
comment: The lowest part of something, especially the part on which it rests or is supported.

Base application
type: Class
equivalent class: Restriction
  on property: Performed by
  some values from: Class
    union of: Aerographic application robot
    union of: Curtain coating machine
    union of: Roller machine
    union of: Spray application gun
subclass of: Finishing
label: Aplicación de fondo @es

Base cabinets
type: Class
subclass of: Kitchen cabinets
disjoint with: Wall cabinets
comment: A storage cupboard, usually with shelves, located below the countertop.
label: Módulos bajos @es

Basic assembly hardware
type: Class
subclass of: Assembly hardware
disjoint with: Fittings
comment: A basic element used to assemble parts.
label: Elementos de unión básicos @es

Basses
type: Class
subclass of: Stringed instruments
comment: A musical instrument that produces a very deep sound.
label: Bajos @es

Bass drums
type: Class
subclass of: Percussion instruments
comment: A large and typically cylindrical drum that produces a note of low definite or indefinite pitch.
label: Bombos @es

Bassoons
type: Class
subclass of: Woodwind instruments
comment: A large musical instrument of the woodwind family that is shaped like a tube and played by blowing into a curved metal pipe.
label: Fagots @es

Bath textile
type: Class
subclass of: Home textiles
comment: A textile product used in the bathroom.
label: Textil de baño @es
alternative label: Bath linen

Bathmats
type: Class
subclass of: Bath textile
comment: An absorbent mat for standing on when entering and leaving a bath.
label: Alfombras de baño @es

Bathrobes
type: Class
subclass of: Bath textile
comment: A long, loose, coat-like garment, often tied with a belt of the same material, worn before and after a bath, over sleepwear, or as leisure wear at home.
label: Albornoces @es
alternative label: Dressing gowns

Bathroom accessories
type: Class
subclass of: Furniture accessories
comment: An accessory for the bathroom.
label: Accesorios de baño @es

Bathroom cabinets
type: Class
subclass of: Cabinets
comment: A cupboard to be used in the bathroom, usually to store towels, bath utilities, consumables like soap, etc. and often medicines
label: Armarios de baño @es

Bathroom
type: Class
subclass of: Furniture compositions
comment: A combination of furniture items to furnish a room in a house that contains a bath or shower, a washbasin, and sometimes a toilet.
label: Baño @es

Bathroom
type: Class
subclass of: Manufacturer
label: Baño @es

Bathtubs
type: Class
subclass of: Bathroom accessories
comment: A large, long container to put water in and then get into to wash the whole body.
label: Bañeras @es
alternative label: Baths

Beach chairs
type: Class
subclass of: Outdoor chairs
comment: A simple chair with a folding frame, and a piece of canvas as the seat and back. Beach chairs are usually used on the beach, on a ship, or in the yard.
label: Sillas de playa @es

Beam
type: Class
subclass of: Building elements
comment: A long piece of wood, metal, concrete, etc, usually supported at both ends, that bears the weight of part of a building or other structure. It usually has a double T shape, although it can have an "I" shape.
label: Viga @es

Beds
type: Class
subclass of: Class
  intersection of: Pieces of furniture
  intersection of: Restriction
    on property: Has base
    some values from: Bed bases
  intersection of: Restriction
    on property: Has base
    all values from: Bed bases
comment: A set of pieces with a framework and mattress, cushinons and coverings to sleep or rest on. Wood or metal framework that supports the rest of the pieces of the set.
label: Camas @es

Bed bases
type: Class
subclass of: Bases
comment: A framework of wood or metal supporting the springs and mattress of a bed.
label: Bases de cama @es
alternative label: Bed structures

Bed linen
type: Class
subclass of: Home textiles
comment: A textile product used to cover and decorate the bed.
label: Ropa de cama @es

Bed sheets
type: Class
subclass of: Bed linen
comment: A rectangular piece of cloth used as bedding, which is larger in length and width than a mattress, and which is placed immediately above a mattress or bed, but below blankets and other bedding.
label: Sábanas @es

Bedside tables
type: Class
subclass of: Domestic tables
comment: A small table which is in the area beside a bed, normally with a drawer and a small cabinet or with several drawers.
label: Mesitas de noche @es

Beechwood
type: Class
subclass of: Wood
comment: A type of tree with white-oranged to rosed wood, right fiber and fine grain.
label: Madera de haya @es

Benches
type: Class
subclass of: Seats
comment: A simple, often backless device, typically for more than one person to sit on. It often refer to simple, longer tables or similar longer flat surfaces to place things on or work on.
label: Bancos @es

Bicycle racks
type: Class
subclass of: Racks
comment: A framework or stand for holding bicycles.
label: Portabicicletas @es
alternative label: Bicycle stands

Bidets
type: Class
subclass of: Bathroom accessories
comment: A small low basin for washing the genitals and anal area.

Bifold doors
type: Class
subclass of: Doors
comment: A door unit that has two to four sections, folding in pairs. The doors can open from either side for one pair, or fold off both sides for two pairs. Wood is the most common material, and doors may also be metal or glass. Bifolds are most commonly made for closets, but may also be used as units between rooms.
label: Puertas plegables @es

Blackboards
type: Class
subclass of: Writing boards
disjoint with: Whiteboards
comment: A blackboard is a reusable writing surface on which text or drawings are made with chalk or other erasable markers. Blackboards were originally made of smooth, thin sheets of black or dark grey slate stone. Sometimes they are green (especially early elementary) or brown (especially at universities) and thus sometimes called a greenboard or brownboard instead.
label: Pizarras @es
alternative label: Chalkboards

Blankets
type: Class
subclass of: Bed linen
comment: A large piece of thick cloth for use as a bed covering, animal covering, etc, enabling a person or animal to retain natural body heat.
label: Mantas @es

Bleaching agents
type: Class
subclass of: Auxiliary substances
label: Blanqueadores @es

Blind doors
type: Class
subclass of: Doors
comment: A door with no visible trim or operable components. It is designed to blend with the adjacent wall in all finishes, and visually to be a part of the wall, a disguised door.
label: Puertas ciegas @es

Blinds
type: Class
subclass of: Windows
comment: A blind with adjustable slats, mainly used on windows and balconies.
label: Mallorquinas @es

Board calibration
type: Class
equivalent class: Restriction
  on property: Performed by
  some values from: Calibrating machine
subclass of: Board preparation
label: Calibración de tableros @es

Board cutting machine
type: Class
subclass of: Manual machines
label: Cortadora de tableros @es

Board preparation
type: Class
subclass of: Processes
label: Preparación de tableros @es

Board
type: Class
subclass of: Material supplier
label: Tablero @es

Boiseries
type: Class
subclass of: Cabinets
comment: An ornate and intricately carved wood panelling. Boiseries became popular in the latter part of the 17th century in French interior design, becoming a de rigueur feature of fashionable French interiors throughout the 18th century. Such panels were most often painted in two shades of a chosen color or in contrasting colors, with gilding reserved for the main reception rooms.
comment: Mueble de madera que va adosado a la pared, cubriéndola por completo, y está compuesto de estantes y provisto de cajones y armarios generalmente en la parte inferior; suele ser de estilo clásico, con molduras gruesas y maderas de calidad y se coloca en comedores, despachos, bibliotecas, etc. @es
alternative label: Boaserie @es

Bollards
type: Class
subclass of: Industrial protection elements
label: Bolardos @es

Bongos
type: Class
subclass of: Percussion instruments
comment: A small drum, usually one of a pair, that is played with the fingers.

Bookcases
type: Class
subclass of: Shelves
disjoint with: Display cases
comment: A piece of furniture, almost always with horizontal shelves, used to store books.
label: Librerías @es
alternative label: Bookshelves

Bowls
type: Class
subclass of: Kitchen accessories
comment: A deep, round dish with a wide, open top, used especially for holding food or liquid.
label: Boles @es
alternative label: Tazones @es

Box-pallets
type: Class
subclass of: Tertiary packaging
subclass of: Restriction
  on property: Foldable
  some values from: boolean
subclass of: Restriction
  on property: Stackable
  some values from: boolean
comment: A cardboard display stand that can also be used as packaging for shipping goods or products.
comment: Un expositor de cartón que también puede ser utilizado como un embalaje para enviar mercancías o productos. @es

Brackets
type: Class
subclass of: Components
comment: An element used to support something, usually aplied to a piece of furniture.
comment: Un elemento que sirve para sostener algo y que habitualmente se aplica sobre una pieza de mobiliario. @es
label: Soportes @es
alternative label: Supports

Brass
type: Class
subclass of: Metal materials
label: Latón @es

Brass instruments
type: Class
subclass of: Wind instruments
disjoint with: Woodwind instruments
comment: A wind instrument consisting of a metal tube (usually brass), which may be bent or straight, a mouthpiece, and a bell at the end opposite the mouthpiece. Although made of metal, it can be originated from natural sources (seashells, hollow branches, or animal horns).
label: Instrumentos de viento-metal @es

Bread baskets
type: Class
subclass of: Storage pieces of furniture
comment: A large container, usually with a lid, for storing bread.
label: Paneras @es
alternative label: Bread bins

Brooms
type: Class
subclass of: Cleaning accessories
disjoint with: Mops
comment: A kind of brush with a long handle used for sweeping the floor.
label: Escobas @es

Brushes
type: Class
subclass of: Tools
label: Cepillos @es

Bubble wrap
type: Class
subclass of: An envelope that protects goods during transportation.
comment: A sheet of plastic bubbles that is used for wrapping things in order to protect them.
comment: Una lámina de plástico de burbujas que se utiliza para envolver objetos para protegerlos. @es
label: Plástico de burbujas @es

Buckets
type: Class
subclass of: Storage pieces of furniture
comment: A round metal or plastic container with a handle attached to its sides. Buckets are often used for holding and carrying water.
label: Cubos @es

Building
type: Class
subclass of: Manufacturer
label: Construcción @es

Building elements
type: Class
subclass of: Products
comment: An element that is primarily part of the construction of a built facility.
label: Elementos de construcción @es

Building envelope
type: Class
subclass of: Building elements
comment: The physical separator between the conditioned and unconditioned environment of a building, including the resistance to air, water, heat, light, and noise transfer.
label: Envolvente de construcción @es
alternative label: Building enclosure
alternative label: Envolvente de edificio @es

Bulbs
type: Class
subclass of: Lighting
comment: The glass part of an electric lamp, which gives out light when electricity passes through it.
label: Bombillas @es

Bumpers
type: Class
subclass of: Mixed use accessories
comment: A device for absorbing shock or preventing damage.
label: Paragolpes @es

Bunks
type: Class
subclass of: Beds
subclass of: Restriction
  on property: Has base
  some values from: Bed bases
subclass of: Restriction
  on property: Has base
  cardinality: 1
subclass of: Restriction
  on property: Upholstered
  some values from: boolean
comment: One of two beds that are fixed together, one above the other, especially for children.
label: Literas @es
alternative label: Bunk beds

Burners
type: Class
subclass of: Kitchen accessories
comment: A device which produces heat or a flame, especially as part of a cooker, stove, or heater.
label: Quemadores @es

Butterfly doors
type: Class
subclass of: Doors
comment: A door so-called because of its two "wings". It consists of a double-wide panel with its rotation axle in the centre, effectively creating two separate openings when the door is opened. Butterfly doors are made to rotate open in one direction (usually counterclockwise), and rotate closed in the opposite direction. The door is not equipped with handles, so it is a "push" door. This is for safety, because if it could open in both directions, someone approaching the door might be caught off guard by someone else opening the other side, thus impacting the first person. Such doors are popular in public transit stations, as it has a large capacity, and when the door is opened, traffic passing in both directions keeps the door open. They are particularily popular in underground subway stations, because they are heavy, and when air currents are created by the movement of trains, the force will be applied to both wings of the door, thus equalizing the force on either side, keeping the door shut.
label: Puertas de mariposa @es

Buyer-Designer
type: Class
subclass of: Service provider
label: Prescriptor @es

Bypass doors
type: Class
subclass of: Doors
comment: A door unit that has 2 or more sections. The doors can slide from each direction on an overhead track, sliding past each other. They are most commonly used in closets, in order to access one side of the closet at a time.
label: Puertas de derivación @es

CNC machines
type: Class
subclass of: Machines
label: Máquinas de control numérico (CNC) @es

CNC automatic lathe
type: Class
subclass of: CNC machines
label: Torno CNC @es

CNC band saw
type: Class
subclass of: CNC machines
label: Sierra de banda automática @es

CNC hot wire foam cutting machine
type: Class
subclass of: CNC machines
label: Cortadora de espuma de hilo caliente @es

CNC machining centre
type: Class
subclass of: CNC machines
label: Centro de mecanizado CNC @es

CNC press for module assembly
type: Class
subclass of: CNC machines
label: Prensa CNC para montaje de módulos @es

CNC router system for machining foam
type: Class
subclass of: CNC machines
label: Sistema enrutador CNC de mecanizado de espuma @es

Cabinets
type: Class
subclass of: Storage pieces of furniture
comment: A box-shaped form, either standing alone as a piece of furniture or built into or attached to a wall typically made of wood but now often made of synthetic materials, and used for storage of miscellaneous items. Cabinets usually have one or more doors on the front that are mounted with door hardware and occasionally a lock; they may also contain drawers. Short cabinets often have a finished surface on top that can be used for display, or as a working surface such as the countertops found in kitchens.
label: Armarios @es

A secure and durable wire mesh structure used for storing various items and materials. They are typically made of galvanized steel and built to withstand environmental factors.
type: Class
subclass of: Tertiary packaging
label: Cages
label: Jaulas de almacenamiento @es
label: Una estructura de malla de alambre segura y duradera que se utiliza para almacenar diversos artículos y materiales. Suelen estar hechas de acero galvanizado y construidas para resistir los factores ambientales. @es

Calibrating machine
type: Class
subclass of: Semi-automatic machines
label: Calibradora @es

Canapés
type: Class
subclass of: Sofas
comment: A piece of furniture similar to a couch that is made out of elaborately carved wood with wooden legs, an upholstered back, armrests, and a single long seat. It is an elegant item that emerged from France in the 18th century.

Candles
type: Class
subclass of: Decoration elements
comment: A stick of hard wax with a piece of string called a wick through the middle that is lit to give light as it burns.
label: Velas @es

Cantilever frames
type: Class
subclass of: Bases
comment: A frame that is typically used when support on the base slab is not possible, especially when a drop beam needs to be supported around the perimeter of a building and the earth around the building is not levelled or compacted.
label: Bastidores oscilantes @es

Cap plugs
type: Class
subclass of: Mixed use accessories
comment: A short, thick piece of wood, metal, or other material that fits into a hole.
label: Tacos @es
alternative label: Tube caps

Capos
type: Class
subclass of: Musical accessories
disjoint with: Drumsticks
comment: A device fitted across all the strings of a guitar, banjo, etc, so as to raise the pitch of each string simultaneously.
label: Cejillas @es

Car park barriers
type: Class
subclass of: Industrial protection elements
label: Barreras de parking @es

Cardboard
type: Class
subclass of: Lignocellulosic materials
label: Cartón @es

Cardboard boxes
type: Class
subclass of: Tertiary packaging
comment: A container made of cardboard or corrugated cardboard, used to pack goods for storage or shipping.
comment: Un contenedor hecho de cartón o cartón corrugado, utilizado para empacar mercancías para almacenamiento o envío. @es
label: Cajas de cartón @es

Carousels
type: Class
subclass of: Playground equipment
comment: A large circular machine with seats, often in the shape of animals or cars, where people can sit on it and go round and round for fun.
label: Carruseles @es

Carpentry
type: Class
subclass of: Manufacturer
label: Carpintería @es

Carpentry installation
type: Class
subclass of: Installation service
label: Instalación de carpintería @es

Carpets
type: Class
subclass of: Mixed use textiles
comment: A floor covering, woven from natural or manmade fibres.
label: Alfombras @es

Carrier
type: Class
subclass of: Material supplier
comment: A person or organisation undertaking to convey goods undertaking to convey goods.
label: Transportista @es

Carrycots
type: Class
subclass of: Children furniture
comment: A product consisting of a base, sides, ends and carrying handle(s), within which a child can be laid down and transported by hand(s).
label: Capazos @es

Carts
type: Class
subclass of: Storage pieces of furniture
comment: A unit for transportation of material or food. It has wheels or castors.
label: Carros @es

Carton erector
type: Class
subclass of: Automatic machines
label: Formadora de cajas @es

Castanets
type: Class
subclass of: Percussion instruments
comment: A musical instrument that consists of two small round pieces of wood that are holded in the hand and hit together with the fingers to make a noise. Castanets are used especially by Spanish dancers.
label: Castañuelas @es

Castors
type: Class
subclass of: Components
comment: Any of the small wheels fixed to the bottom of a piece of furniture so that it can be moved easily.
label: Ruedas @es

Cat ladders
type: Class
subclass of: Ladders
comment: A lightweight ladder frame used on steep roofs to prevents workers from sliding.
label: Escaleras ligeras @es

Catalogue
type: Class
comment: Complete list of items (entities), usually in a special order and with a description of each.
label: Catálogo @es

Catalysts
type: Class
subclass of: Coating substances
comment: The catalyst is a substance that increases the rate of a reaction without itself being consumed. This is also called "endurecedor" in Spanish.
label: Catalizadores @es

Ceiling lighting
type: Class
subclass of: Lighting
comment: A light source that is installed on the ceiling and provides even illumination to support everyday tasks that require ample light.
label: Iluminación de techo @es

Cellos
type: Class
subclass of: Stringed instruments
comment: A musical instrument with strings, like a large violin in shape. The player sits down and holds the cello between his or her knees.
label: Violonchelos @es
alternative label: Chelos @es
alternative label: Violoncellos

Ceramics materials
type: Class
subclass of: Materials
label: Cerámica y derivados @es

Ceramic
type: Class
subclass of: Material supplier
label: Cerámica @es

Certification
type: Class
subclass of: Service provider
label: Certificación @es

Certification service
type: Class
subclass of: Services
label: Servicio de certificación @es

Chairs
type: Class
subclass of: Seats
subclass of: Restriction
  on property: Upholstered
  some values from: boolean
comment: A movable seat with a back and sometimes with arms, for one person to sit on.
label: Sillas @es

Chaise longue
type: Class
subclass of: Sofas
comment: A long low seat with one arm, on which the person sitting can stretch out her or his legs.

Chamfering
type: Class
equivalent class: Restriction
  on property: Performed by
  some values from: Class
    union of: Double edge bander
    union of: Edge bander with automatic dragging
    union of: Edge bander with nanual dragging
    union of: Numerical control double edge bander
    union of: Numerical control edge bander
subclass of: Machining operation
label: Chapado de cantos @es

Chandeliers
type: Class
subclass of: Ceiling lighting
comment: A large, decorative frame which holds light bulbs or candles and hangs from the ceiling.
label: Candelabros @es
alternative label: Lámparas de araña @es

Changing tables
type: Class
subclass of: Children furniture
comment: A small raised platform designed to allow a person to change another person's diaper. It is usually used for babies.
label: Cambiadores del bebé @es

Chargers
type: Class
subclass of: Household appliances
comment: A piece of equipment for loading a battery with electricity.
label: Cargadores @es

Chemical protection gloves
type: Class
subclass of: Personal protective equipment
comment: Usually made of rubber or latex.
label: Guantes de protección contra químicos @es

Chemical substances
type: Class
subclass of: Materials
subclass of: Restriction
  on property: Composition
  some values from: string
subclass of: Restriction
  on property: Special effects
  some values from: string
subclass of: Restriction
  on property: Anti-mosquito
  some values from: boolean
subclass of: Restriction
  on property: Antibacterial
  some values from: boolean
subclass of: Restriction
  on property: Fireproof
  some values from: boolean
subclass of: Restriction
  on property: Waterproof
  some values from: boolean
comment: A type of solid, liquid or gas that has particular qualities.
label: Substancias químicas @es
alternative label: Sustancias @es

Chenille fabric
type: Class
subclass of: Synthetic fabric
label: Tejido chenilla @es

Cherrywood
type: Class
subclass of: Wood
comment: Wood from the cherry tree, its colour is pale brown and presents fine grain and even texture.
label: Madera de cerezo @es

Chests
type: Class
subclass of: Storage pieces of furniture
comment: A large strong usually wooden box, with a lid with hinges in one side and locks on the other. It is used for keeping robes and things in.
label: Baúles @es

Chests of drawers
type: Class
subclass of: Storage pieces of furniture
comment: A piece of furniture designed to contain a set of drawers (as for holding clothing). It has multiple parallel, horizontal drawers stacked one above each other. Chests of drawers have traditionally been made and used for storing clothing, especially underwear, socks, and other items not normally hung in or otherwise stored in a closet. Chest of drawers are often placed in a bedroom for this purpose, but can actually be used to store anything that will fit inside and can be placed anywhere in a house or another place. In Spanish, "cómoda" or "cómoda de cajones".
label: Cómodas/Cajoneras @es
alternative label: Cajoneras @es
alternative label: Dressers

Chests of drawers with babybath
type: Class
subclass of: Chests of drawers
comment: A bath chest of drawers with a changing table and a bathtub tailored to the needs of the toddler and her/his mother.
label: Cómodas con bañera @es

Chiffoniers
type: Class
subclass of: Cabinets
comment: A piece of furniture differentiated from the sideboard by its smaller size and by the enclosure of the whole of the front by doors. Its name (which comes from the French for a "rag-gatherer") suggests that it was originally intended as a receptacle for odds and ends which had no place elsewhere, but it now usually serves the purpose of a sideboard. It is a remote and illegitimate descendant of the cabinet; it has rarely been elegant and never beautiful.

Child bedroom
type: Class
subclass of: Furniture compositions
comment: A combination of furniture items to furnish a room used by children for sleeping in it.
label: Dormitorio infantil @es

Childcare
type: Class
subclass of: Manufacturer
label: Mueble Infantil @es

Children furniture
type: Class
subclass of: Pieces of furniture
comment: A piece of furniture to be used by children.
label: Muebles infantiles @es
alternative label: Mobiliario infantil @es

Chroming
type: Class
equivalent class: Restriction
  on property: Performed by
  some values from: Chroming facility
subclass of: Finishing
label: Cromado @es

Chroming facility
type: Class
subclass of: Manual machines
comment: Set of cells filled of chroming material where the pieces are bathed. This application is based on a electrolytic process. Through this porcess the chroming material is attached to the piece forming a coating. The thickness of the chroming layer depends on the duration of the immersion of the pieces into the cells.
label: Instalación de cromado @es

Chronometers
type: Class
subclass of: Measuring instruments
label: Cronómetros @es

Church pews
type: Class
subclass of: Religious benches
comment: Any of the long seats with a back that are placed in rows in a church for people to sit on.
label: Bancos de iglesia @es
alternative label: Pews

Circular rotating saw with four edges, feeding and stacker
type: Class
subclass of: Semi-automatic machines
label: Sierra circular de cuatro cantos con giro ó angular con alimentador y apilador @es

Circular saw for double edge with cart
type: Class
subclass of: Manual machines
label: Sierra circular de dos cantos con carro @es

Circular saw for double edge with feeding and stacker
type: Class
subclass of: Semi-automatic machines
label: Sierra circular de dos cantos con alimentador y apilador @es

Circular table saw with manual thrust
type: Class
subclass of: Manual machines
label: Sierra circular de mesa con empuje manual @es

Clarinets
type: Class
subclass of: Woodwind instruments
comment: A single-reed woodwind instrument with a long wooden or metal tube and a flaring bell, played by means of holes and keys.
label: Clarinetes @es

Clavichords
type: Class
subclass of: Keyboard instruments
comment: An early type of musical instrument, like a piano with a very soft tone.
label: Clavicordios @es
alternative label: Clavecines @es
alternative label: Harpsichords

Cleaning accessories
type: Class
subclass of: Furniture accessories
comment: An accessory for cleaning.
label: Accesorios de limpieza @es

Facility Cleaning
type: Class
subclass of: Service provider
label: Limpieza Instalaciones @es

Climbing structures
type: Class
subclass of: Playground equipment
comment: Recreational equipment designed for children to climb, promoting the development of motor and social skills.
label: Trepadores @es

Closet / Cupboard
type: Class
subclass of: Manufacturer
label: Armarios @es

Cloth cutting
type: Class
equivalent class: Restriction
  on property: Performed by
  some values from: Class
    union of: Automatic cutting machine
    union of: Manual cutting machine
subclass of: Upholstering
label: Corte de tela @es

Clothes butler
type: Class
subclass of: Racks
comment: A piece of furniture to hang clothes on.
label: Galán de noche @es
alternative label: Clothes valet
alternative label: Suit stands

Clothes irons
type: Class
subclass of: Household appliances
comment: A tool with a flat metal base that can be heated and used to make clothes smooth.
label: Planchas de ropa @es

Coat racks
type: Class
subclass of: Racks
comment: A rack, often wall-mounted, or upright pole fitted with branching hooks or pegs on which to hang coats, hats, etc.
label: Percheros @es
alternative label: Coat hooks

Coating substances
type: Class
subclass of: Chemical substances
comment: This class is usually called in Spanish "Pinturas y Barnices (recubrimiento)".
label: Substancias de recubrimiento @es
alternative label: Sustancias de recubrimiento @es

Coconut fibre
type: Class
subclass of: Natural fibre
label: Fibra de coco @es

Coffee tables
type: Class
subclass of: Domestic tables
comment: A style of long, low table which is designed to be placed in front of a couch, to support beverages (hence the name), magazines, books (especially coffee table books), and other small items to be used while sitting, such as coasters. Coffee tables are usually found in the living room or sitting room. They are available in many different variations and prices vary from style to style. Coffee tables may also incorporate cabinets for storage.
label: Mesas de café @es

Coffins
type: Class
subclass of: Storage pieces of furniture
comment: Funerary box used in the display and containment of deceased remains, either for burial or cremation.
label: Ataúdes @es
alternative label: Féretros @es

Colormeters
type: Class
subclass of: Measuring instruments
label: Colorímetros @es

Column guards
type: Class
subclass of: Industrial protection elements
label: Protectores de columna @es

Commercial services
type: Class
subclass of: Services
label: Servicios comerciales @es

Communion rails
type: Class
subclass of: Religious benches
comment: A low barrier or kneeler placed in front of the altar or within the sanctuary of Catholic churches. Its purpose is to provide a reverent place for the faithful to kneel - or stand - to receive Holy Communion.
label: Bancos de comunión @es
alternative label: Altar rails

Communion tables
type: Class
subclass of: Religious tables
comment: The table in Christian churches where communion is given.
label: Mesas de comunión @es

Compact beds
type: Class
equivalent class: Restriction
  on property: Has desk
  some values from: Home student desks
subclass of: Beds
comment: A bed usually designed for young people or children that may consists of modular furniture; wardrobes, shelf units, desk, etc. all in the same structure together with the bed or beds.
label: Camas compactas @es

Compact cardboard
type: Class
subclass of: Cardboard
disjoint with: Honeycomb
label: Cartón compacto @es

Components
type: Class
comment: Any of the parts of which something is made. Components are to be combined with others for use as a whole.
comment: Cualquiera de las partes de las que se compone algo. Los componentes son a menudo combinados entre sí para su uso como un conjunto. @es
label: Componentes @es
alternative label: Part
alternative label: Parte @es

Composite material
type: Class
subclass of: Materials
label: Material composite @es
alternative label: Material compuesto @es

Composites
type: Class
subclass of: Material supplier
label: Materiales Compuestos @es

Computer desks
type: Class
subclass of: Office tables
comment: A desk made specifically with the idea that a desktop computer and its accessories will be housed on or inside it.
label: Mesas de ordenador @es

Conference tables
type: Class
subclass of: Office tables
comment: A big table used for conference meetings.
label: Mesas de conferencias @es

Consoles
type: Class
subclass of: Domestic tables
comment: An auxiliary table made to be close to the wall and used to put decoration objects on it.
label: Consolas @es

Consulting
type: Class
subclass of: Service provider
label: Consultoría @es

Consulting service
type: Class
subclass of: Services
label: Servicio de consultoría @es

Contact application
type: Class
subclass of: Techniques
comment: Application of some finishing substance through the contact between the material and the finishing substance.
label: Aplicación por contacto @es

Contact person
type: Class
subclass of: Restriction
  on property: E-mail
  some values from: string
comment: An individual designated to serve as the primary point of communication for a specific purpose, organization, or event.
label: Persona de contacto @es

Containers
type: Class
subclass of: Tertiary packaging
subclass of: Restriction
  on property: EPAL certificate
  some values from: boolean
subclass of: Restriction
  on property: Folding doors
  some values from: boolean
subclass of: Restriction
  on property: Interior construction
  some values from: boolean
subclass of: Restriction
  on property: ISPM-15 certificate
  some values from: boolean
subclass of: Restriction
  on property: Skate
  some values from: boolean
subclass of: Restriction
  on property: Foldable
  some values from: boolean
subclass of: Restriction
  on property: Stackable
  some values from: boolean
comment: A very large metal or wooden box used for transporting goods so that they can be loaded easily onto ships and lorries.
comment: Una caja muy grande de metal o madera que se utiliza para transportar mercancías de manera que puedan cargarse fácilmente en barcos y camiones. @es
label: Contenedores @es

CONTRACT Channel
type: Class
subclass of: Manufacturer
label: Canal CONTRACT @es

Cooktops
type: Class
subclass of: Kitchen accessories
comment: Superficie superior del horno donde se colocan los elementos calefactores. @es
comment: The top surface of the oven on which heating elements are located.
label: Placas de cocción @es
alternative label: Vitrocerámicas @es

Cork
type: Class
subclass of: Lignocellulosic materials
label: Corcho @es

Cork
type: Class
subclass of: Material supplier
label: Corcho @es

Corner pieces
type: Class
subclass of: Cushion packaging
comment: A bent metal piece used to reinforce or protect the angles of certain objects.
comment: Una pieza de metal en forma acodada que sirve para consolidar o proteger los ángulos de determinados objetos. @es
label: Cantoneras @es

Corner sofas
type: Class
subclass of: Sofas
comment: A multi-seat sofa that turns ninety degrees to create a continuous seating line.
label: Rinconeras @es
alternative label: Corner couches

Corrugated cardboard
type: Class
subclass of: An envelope that protects goods during transportation.
comment: A material used primarily for the manufacture of containers and packaging, which is normally composed of three or five papers (those of the two outer layers are smooth and the inner or inner layers are corrugated), providing great mechanical resistance to the structure.
comment: Un material utilizado fundamentalmente para la fabricación de envases y embalajes, que normalmente se compone de tres o cinco papeles (los de las dos capas exteriores son lisos y el interior o los interiores ondulados), proporcionando una gran resistencia mecánica a la estructura. @es
label: Cartón ondulado @es

Cotton fibre
type: Class
subclass of: Natural fibre
label: Fibra de algodón @es

Counters
type: Class
subclass of: Tables
comment: A long narrow table or flat surface at which customers are served.
label: Mostradores @es

An envelope that protects goods during transportation.
type: Class
subclass of: Tertiary packaging
comment: Una envoltura que protege las mercancías durante el transporte. @es
label: Coverings
label: Recubrimientos @es

Cradles
type: Class
subclass of: Children furniture
subclass of: Restriction
  on property: Co-sleeping convertible
  some values from: boolean
comment: A small bed for a baby, usually shaped like an open box, which can be pushed form side to side.
label: Minicunas @es

Creative play structures
type: Class
subclass of: Playground equipment
comment: A structure designed for any type of play that allows children to use their imagination and express themselves freely through a variety of activities.
label: Juegos imaginativos @es

Cribs
type: Class
subclass of: Children furniture
comment: (Also "cot" and "infant bed"). Small bed specifically for infants. Cots are typically used as a bed for a baby after it is no longer safe to leave them in a bassinet. Cots are more stable than bassinettes and become desirable when a baby can roll. They have a lower center of gravity, a broader base of support and can hold a larger baby than a bassinet. Cots are designed to restrict the baby to the bed. The sides are too high for a baby to climb and provide no footholds. The thinking behind this design is that if baby wakes up, they will return to sleep rather than roam around the house. To improve the reliability of the confinement, a top (solid or fabric) may be added to a cot.
label: Cunas @es
alternative label: Cots

Cross-laminated timber
type: Class
subclass of: Building timber
label: Madera contralaminada @es

Crossbars
type: Class
subclass of: Sawn timber
label: Largueros @es

Cups
type: Class
subclass of: Kitchen accessories
comment: A small, round container, usually with a handle, from which drink hot drinks such as tea and coffee.
label: Tazas @es

Cup application gun
type: Class
subclass of: Spray application gun
label: Pistola de aplicación cup @es

Cup containers
type: Class
subclass of: Tools
label: Recipientes @es

Cupboards
type: Class
subclass of: Cabinets
comment: A type of cabinet, often made of wood, used indoors to store household objects such as food and crockery, and protect them from dust and dirt.
comment: Un tipo de armario, habitualmente fabricado en madera, usado en interiores para guardar elementos del hogar tales como comida y vajilla, protegiéndolos del polvo y la suciedad. @es
label: Despensas @es
alternative label: Alacenas @es
alternative label: Pantries

Curtains
type: Class
subclass of: Mixed use textiles
comment: A piece of material that can be drawn across an opening or window, to shut out light or to provide privacy.
label: Cortinas @es

Curtain coating machine
type: Class
subclass of: Semi-automatic machines
label: Barnizadora de cortina @es

Curtain tie backs
type: Class
subclass of: Mixed use textiles
comment: A support element that helps keep the curtain folded, without damaging it, allowing as much light as possible into the room, and preventing drafts from moving it out of place.
label: Abrazaderas de cortina @es

Curve sanding
type: Class
equivalent class: Restriction
  on property: Performed by
  some values from: Manual sander for curved pieces
subclass of: Surface preparation
label: Lijado de curvas @es

Cushions
type: Class
subclass of: Mixed use textiles
comment: A small bag filled with soft material, feathers, etc. They are used to make a seat more comfortable, to kneel on, etc.
label: Cojines @es

Cushion covers
type: Class
subclass of: Mixed use textiles
comment: A removable textile cover designed to protect and decorate a cushion for seats, sofas or beds.
label: Fundas de cojín @es

Cushion packaging
type: Class
subclass of: Tertiary packaging
comment: Embalaje de protección para la absorción de impactos. @es
comment: Protective packaging for shock absorption.
label: Embalaje de protección @es
alternative label: Embalaje amortiguador @es

Customs management
type: Class
subclass of: Logistics services
comment: A service that considers all activities related to importing/exporting goods across national borders, including compliance with customs regulations, duty payments, documentation submission, and risk mitigation.
label: Gestión aduanera @es

Cutleries
type: Class
subclass of: Kitchen accessories
comment: The utensils (knives, forks, and spoons) used for serving and eating food.
label: Cubiertos @es
alternative label: Cuberterías @es

Cutlery chests
type: Class
subclass of: Chests
disjoint with: Medicine chests
comment: A piece of furniture used to store the cutlery.
label: Cuberteros @es

Cutlery drawers
type: Class
subclass of: Drawers
comment: A drawer with small moulds or accesories to store the cutlery.
label: Cajones de cubertería @es

Cutting machine with cutting optimizer
type: Class
subclass of: Semi-automatic machines
label: Tronzadora automática con optimizador de corte @es

Cutting off
type: Class
equivalent class: Restriction
  on property: Performed by
  some values from: Class
    union of: Board cutting machine
    union of: Cutting machine with cutting optimizer
    union of: Cutting off machine
subclass of: First processing
comment: Wound or an opening made with something sharp. A service or preparation of reducing something in size, such as paper, boards, textiles, timber, etc. This operation may incurr a extra charge for the service.
label: Tronzado @es

Cutting off machine
type: Class
subclass of: Semi-automatic machines
label: Tronzadora de troncos @es

Cymbals
type: Class
subclass of: Percussion instruments
comment: A musical instrument in the form of a round metal plate. It is hit with a stick, or two cymbals are hit against each other.
label: Címbalos @es

Deck chairs
type: Class
subclass of: Outdoor chairs
comment: A folding chair with a seat made of a length of canvas or plastic hung on a usually wooden frame.
label: Tumbonas @es

Decorated Paper
type: Class
subclass of: Material supplier
label: Papel Decorado @es

Decoration elements
type: Class
subclass of: Furniture accessories
comment: An element used for decoration purposes.
label: Elementos de decoración @es

Deep fryers
type: Class
subclass of: Household appliances
comment: A device for cooking food by submerging it in hot fat.
label: Freidoras @es
alternative label: Deep-fat fryers

Delivery
type: Class
subclass of: Processes
comment: The formal handing over of goods or of completing services.
label: Entrega @es

Dentist chairs
type: Class
subclass of: Professional chairs
comment: A specialized piece of equipment used in dental offices to position patients comfortably during dental procedures.
label: Sillones de dentista @es

Deposition application
type: Class
subclass of: Techniques
comment: The material is placed inside a bucket and this is poured generating a curtain of varnish. When the piece passes under the curtain of varnish, the material is placed on the piece.
label: Decantación @es

Derinding machine
type: Class
subclass of: Semi-automatic machines
label: Descortezadora de troncos @es

Desk chairs
type: Class
subclass of: Domestic chairs
comment: A chair that is typically more compact, lighter, and less focused on long-term ergonomics than an office chair.
label: Sillas de escritorio @es

Desk lamps
type: Class
subclass of: Lighting
comment: A portable lighting device designed for use on a desk or work surface. It provides adjustable lighting for tasks such as reading, writing, or working on a computer.
label: Lámparas de escritorio @es
alternative label: Flexo @es

Dimensioned cutting
type: Class
equivalent class: Restriction
  on property: Performed by
  some values from: Class
    union of: Angular horizontal rip saw
    union of: Horizontal rip saw
    union of: Horizontal rip saw with feeding
    union of: Sliding table saw with manual thrust
    union of: Vertical sliding table saw
    union of: Vertical sliding table saw with automatic movement
subclass of: Machining operation
label: Dimensionado @es

Dining chairs
type: Class
subclass of: Domestic chairs
comment: A chair that is designed for sitting on at a table to eat meals, usually with a back and no arms.
label: Sillas de comedor @es
alternative label: Side chairs

Dining room
type: Class
subclass of: Furniture compositions
comment: A combination of furniture items to furnish a room in a house where people have their meals, or a room in a hotel where meals are served.
label: Comedor @es

Dining tables
type: Class
subclass of: Domestic tables
comment: A table in the dining room on which meals are served.
label: Mesas de comedor @es

Director chairs
type: Class
subclass of: Professional chairs
comment: A lightweight folding armchair, usually a wooden or metal frame with a canvas back and seat.
label: Sillas del director @es

Disc sander
type: Class
subclass of: Manual machines
label: Lijadora de disco @es

Discoloration
type: Class
subclass of: Finishing
comment: This is usually a manual process done by using hydrogen peroxide or another destaining product.
label: Decolorado @es

Dishwashers
type: Class
subclass of: Household appliances
comment: An appliance designed to automatically wash and dry dishes.
comment: Dispositivo diseñado para lavar y secar la vajilla automáticamente. @es
label: Lavavajillas @es

Dispatching
type: Class
subclass of: Processes
label: Entrega @es

Display cases
type: Class
subclass of: Shelves
comment: A piece of furniture with shelves to display things.
label: Vitrinas @es

Distribution
type: Class
subclass of: Services
label: Distribución @es

Distributor
type: Class
subclass of: Service provider
label: Distribuidor @es

Divan
type: Class
subclass of: Sofas
comment: A long low seat usually without a back or arms.
label: Diván @es

Dock buffers
type: Class
subclass of: Industrial protection elements
label: Protectores para muelle de carga @es

Dock gates
type: Class
subclass of: Industrial protection elements
label: Puerta de muelle de carga @es

Dog park equipment
type: Class
subclass of: Outdoor equipment
comment: Equipment designed for an enclosed area in a city, where domestic dogs can be brought to exercise and interact.
label: Equipamiento de parque para perros @es

Domestic chairs
type: Class
subclass of: Chairs
comment: A chair that is designed for domestic use.
label: Sillas de hogar @es

Domestic tables
type: Class
subclass of: Tables
comment: A table to be used at home (indoors).
label: Mesas de hogar @es

Doors
type: Class
subclass of: Pieces of furniture
subclass of: Restriction
  on property: Vertical surface
  all values from: Vertical surfaces
subclass of: Restriction
  on property: Vertical surface
  qualified cardinality: 1
  on class: Vertical surfaces
comment: A flat movable barrier that is fitted into and closes the entrance to a building, room, cupboard, car, etc.
label: Puertas @es

Door stoppers
type: Class
subclass of: Mixed use accessories
comment: An object or device used to hold a door open or closed, or to prevent a door from opening too widely,
label: Topes de puerta @es
alternative label: Door stops
alternative label: Door wedges

Door frames
type: Class
subclass of: Frames
comment: The rectangular frame that surrounds an opening into which a door fits.
label: Marcos de puerta @es

Doors / Windows
type: Class
subclass of: Manufacturer
label: Puertas / Ventanas @es

Double basses
type: Class
subclass of: Stringed instruments
comment: The largest instrument of the violin family, having three or, usually, four strings, rested vertically on the floor when played.
label: Contrabajos @es
alternative label: Contrabasses

Double bedroom
type: Class
subclass of: Furniture compositions
comment: A combination of furniture items to furnish a room used by more than one people for sleeping in.
label: Dormitorio de matrimonio @es
alternative label: Dormitorio doble @es
alternative label: Twin bedroom

Double blade mitre saw
type: Class
subclass of: Manual machines
label: Tronzadora de dos cabezales @es

Double edge bander
type: Class
subclass of: Semi-automatic machines
label: Canteadora doble @es

Double head tenoning
type: Class
subclass of: Semi-automatic machines
label: Espigadora de doble cabezal @es

Double head tenoning with supply
type: Class
subclass of: Semi-automatic machines
label: Espigadora de doble cabezal con alimentación @es

Double roll forming machine
type: Class
subclass of: Semi-automatic machines
label: Perfiladora doble @es

Double side sanding
type: Class
equivalent class: Restriction
  on property: Performed by
  some values from: Dual action sandler
subclass of: Surface preparation
label: Lijado dos caras @es

Double spindle moulder
type: Class
subclass of: Semi-automatic machines
label: Tupí doble @es

Double spindler moulder with return
type: Class
subclass of: Semi-automatic machines
label: Tupí doble con retorno @es
alternative label: Copying and shaping sanding machine

Dowel pins
type: Class
subclass of: Basic assembly hardware
comment: A wooden or metal peg that fits into two corresponding holes to join two adjacent parts.
label: Pasadores @es

Drawers
type: Class
subclass of: Components
comment: A container, similar to a box, with one or more handles but no lid, that slides in and out of a piece of furniture.
label: Cajones @es

Drawing tables
type: Class
subclass of: Office tables
comment: A drawing table usually has a top that can be tilted for making large or technical drawing. It might have a ruler or similar element integrated. If often has a surface adjustable for elevation and angle of incline to facilitate working with technical or architectural drawings.
label: Mesas de dibujo @es

Dressers
type: Class
subclass of: Chests of drawers
comment: A piece of bedroom furniture with a mirror and drawers.
label: Tocadores @es

Drilling
type: Class
equivalent class: Restriction
  on property: Performed by
  some values from: Class
    union of: Drilling machine with multiple heads
    union of: Drilling machine with multiple heads, feeder and downloading
    union of: Multiple drill
    union of: Numerical control drilling machine with multiple heads, feeder and downloading
    union of: Simple drill
subclass of: Machining operation
label: Taladrado @es

Drilling machine with multiple heads
type: Class
subclass of: Semi-automatic machines
label: Taladradora de múltiples cabezales @es

Drilling machine with multiple heads, feeder and downloading
type: Class
subclass of: Semi-automatic machines
label: Taladradora de múltiples cabezales con alimentador y descarga @es

Drums
type: Class
subclass of: Percussion instruments
comment: A musical instrument made of a hollow round frame with plastic or skin stretched tightly across one or both ends. It is played by hitting it with sticks or with the hands.
label: Tambores @es

Drum press
type: Class
subclass of: Semi-automatic machines
label: Prensa de tambor @es

Drumsticks
type: Class
subclass of: Musical accessories
comment: A stick used for playing a drum.
label: Baquetas @es

Dry filter application cabin
type: Class
equivalent class: Restriction
  on property: Employs
  some values from: Dry filter drying
subclass of: Drying tunnel
label: Cabina de aplicación de filtro seco @es

Dry filter drying
type: Class
subclass of: Techniques
label: Secado por filtro seco @es

Dryers
type: Class
subclass of: Household appliances
comment: A powered household appliance that is used to remove moisture from a load of clothing, bedding and other textiles, usually shortly after they are washed in a washing machine.
comment: Un electrodoméstico utilizado para eliminar la humedad de las prendas, ropa de cama y otros textiles, normalmente de forma inmediata después de haber sido lavadas. @es
label: Secadoras @es
alternative label: Tumble dryers

Drying
type: Class
equivalent class: Restriction
  on property: Performed by
  some values from: Class
    union of: Drying tunnel
    union of: Hot air drying tunnel
subclass of: Finishing
label: Secado @es

Drying racks
type: Class
subclass of: Racks
comment: A device intended for hanging clothing to dry. Usually constructed from wood or metal, there are many types of drying racks, including large, stationary outdoor racks, smaller, folding portable racks, and wall wounted drying racks. A drying rack is similar in usage and function to a clothes line.
label: Tendederos @es
alternative label: Clothes horses

Drying tunnel
type: Class
subclass of: Automatic machines
label: Túnel de secado @es

Dual action sandler
type: Class
subclass of: Automatic machines
label: Lijadora doble @es

Duvets
type: Class
subclass of: Bed linen
comment: A style of comforter, often filled with down, having a slipcover and used in place of a top sheet and blankets . In Spanish, a distinction is often made between the concepts "Edredón" and "Nórdico" inside the "Duvet" class. "Nórdico" is a Duvet with no filling or cover.
comment: Un estilo de edredón, a menudo relleno de plumas, que tiene una funda y se usa en lugar de una sábana superior y mantas. En Español, a menudo se distingue entre los conceptos "Edredón" y "Nórdico" dentro de la clase "Duvet". "Nórdico" puede considerarse un "Edredón" sin relleno o funda. @es
label: Edredones @es
alternative label: Nórdicos @es

Duvet covers
type: Class
subclass of: Bed linen
comment: The baglike cover into which the duvet is placed when you make a bed and which often makes a top sheet unnecessary.
label: Fundas de edredón @es
alternative label: Fundas nórdicas @es

Dyes
type: Class
subclass of: Coating substances
subclass of: Restriction
  on property: Solvent-based
  some values from: boolean
subclass of: Restriction
  on property: Water-based
  some values from: boolean
comment: A dye is a colored substance that has an affinity to the substrate to which it is being applied. The dye is generally applied in an aqueous solution, and may require a mordant to improve the fastness of the dye on the fiber.
label: Tintes @es
alternative label: Tints

Easels
type: Class
subclass of: Racks
comment: A wooden frame that supports a picture which an artist is painting or drawing.
label: Caballetes @es

Edge bands
type: Class
subclass of: Laminated coating materials
label: Cantos @es

Edge bander
type: Class
subclass of: Semi-automatic machines
label: Canteadora @es

Edge bander with automatic dragging
type: Class
subclass of: Semi-automatic machines
label: Canteadora con arrastre automático @es

Edge bander with nanual dragging
type: Class
subclass of: Manual machines
label: Chapadora de arrastre manual @es

Edge board preparation
type: Class
equivalent class: Restriction
  on property: Performed by
  some values from: Class
    union of: Circular rotating saw with four edges, feeding and stacker
    union of: Circular saw for double edge with cart
    union of: Circular saw for double edge with feeding and stacker
subclass of: Board preparation
label: Saneado de bordes de tablero @es

Edge sanding
type: Class
equivalent class: Restriction
  on property: Performed by
  some values from: Sanding machine for edges
subclass of: Surface preparation
label: Lijado de cantos @es

Edge shaping
type: Class
equivalent class: Restriction
  on property: Performed by
  some values from: Class
    union of: Circular table saw with manual thrust
    union of: Double roll forming machine
    union of: Single roll forming machine
subclass of: Board preparation
label: Perfilado de cantos @es

Elastomer plastics
type: Class
subclass of: Plastic materials
label: Plásticos elastómeros @es

Electric stacker
type: Class
subclass of: Manual machines
label: Apilador eléctrico @es

Electric stapler
type: Class
subclass of: Manual machines
label: Grapadora eléctrica @es

Electric stoves
type: Class
subclass of: Household appliances
comment: A device that converts electrical energy into heat, providing a warm environment.
label: Estufas eléctricas @es

Electrical installation
type: Class
subclass of: Installation service
label: Instalación eléctrica @es

Electronic Components
type: Class
subclass of: Material supplier
label: Componentes Electrónicos @es

Electrostatic application gun
type: Class
subclass of: Spray application gun
label: Pistola de aplicación electrostática @es

End grain preparation
type: Class
equivalent class: Restriction
  on property: Performed by
  some values from: Class
    union of: Angular roll forming machine
    union of: Double roll forming machine
subclass of: Board preparation
label: Perfilado de testas @es

End tables
type: Class
subclass of: Domestic tables
comment: A small table typically placed beside couches or armchairs. Often lamps will be placed on it.
label: Mesas auxiliares @es

Engineering
type: Class
subclass of: Service provider
label: Ingenieria @es

Engineering service
type: Class
subclass of: Services
label: Servicio de ingeniería @es

EPOXI resins
type: Class
subclass of: Adhesives
label: Resinas EPOXI @es

EPS (expanded polystyrene)
type: Class
subclass of: Thermoset plastics
label: EPS (poliestireno expandido) @es

Extension ladders
type: Class
subclass of: Ladders
comment: A fixed ladder divided into two or more lengths for more convenient storage; the lengths can be slid together for storage or slid apart to maximise the length of the ladder; a pulley system may be fitted so that the ladder can be easily extended by an operator on the ground then locked in place using the dogs and pawls.
label: Escaleras de extensión @es

Facility cleaning
type: Class
subclass of: Services
label: Limpieza de instalaciones @es

Facility maintenance
type: Class
subclass of: Services
label: Mantenimiento de instalaciones @es

False doors
type: Class
subclass of: Doors
comment: A wall decoration that looks like a door.
label: Puertas falsas @es

Felts
type: Class
subclass of: Mixed use accessories
comment: A thick cloth made from wool or other fibres packed tightly together.
label: Fieltros @es

Fibre boards
type: Class
subclass of: Wooden boards
comment: Type of inexpensive material use to make furniture, made with corrigated fibres, is light in weight, yet strong and durable.
label: Tableros de fibra @es

Fibreglass reinforced polyester
type: Class
subclass of: Thermoset plastics
label: Poliéster reforzado con fibra de vidrio @es

Fibreglass reinforced PP (polypropylene)
type: Class
subclass of: Thermoplastics
label: PP (polipropileno) con fibra de vidrio @es

Filing cabinets
type: Class
subclass of: Cabinets
comment: A piece of office furniture with deep drawers for storing files, cards, etc.
label: Archivadores @es

Film baler
type: Class
equivalent class: Restriction
  on property: Employs
  some values from: Hot shrinking packaging
subclass of: Automatic machines
label: Embaladora de film @es

Finishing
type: Class
subclass of: Processes
label: Acabado @es

Fire extinguisers
type: Class
subclass of: Safety equipment
label: Extintores de incendios @es

First processing
type: Class
subclass of: Processes
label: Primera transformación @es

Fitted carpets
type: Class
subclass of: Carpets
comment: A carpet that has been cut, sewn, or otherwise adapted to cover a floor completely.
label: Moquetas @es

Fittings
type: Class
subclass of: Assembly hardware
comment: A small part on or attached to a piece of furniture or equipment, usually on iron.
label: Herrajes @es

Fitting
type: Class
subclass of: Material supplier
label: Herrajes @es

Fixed ladders
type: Class
subclass of: Ladders
comment: A vertical ladder mounted permanently to a structure. This is primarily used to access roofs or other structures for industrial purposes.
label: Escaleras fijas @es

Flanges
type: Class
subclass of: Retention packaging
comment: A toothed strip of plastic or metal, non-retractable once hooked, that allows tying, joining or immobilizing.
comment: Una tira dentada de plástico o de metal, no retráctil una vez enganchada, que permite atar, unir o inmovilizar. @es
label: Bridas @es
alternative label: Clamps

Flax fibre
type: Class
subclass of: Natural fibre
label: Fibra de lino @es

Floodlights
type: Class
subclass of: Lighting
comment: A large powerful light that produces a wide beam.
label: Focos @es

Floor covering
type: Class
subclass of: Floorings and coatings
comment: A solid layer over the floor joists that provides a solid, flat surface for the floor and makes the floor stronger and more rigid to support furniture and people.
label: Revestimiento de suelos @es

Floor lamps
type: Class
subclass of: Lighting
comment: An electric light supported by a tall pole that is attached to a base that rests on the floor of a room.
label: Lámparas de pie @es

Floorings and coatings
type: Class
subclass of: Building elements
comment: A material that is used to make the floor of a room or coat over a surface.
label: Suelos y revestimientos @es

Flowerpots
type: Class
subclass of: Decoration elements
comment: A small, round container made of plastic or clay for growing a single plant in.
label: Macetas @es

Flush doors
type: Class
subclass of: Doors
comment: A completely smooth, panelled door, having plywood or MDF fixed over a light timber frame, the hollow parts of which are often filled with a cardboard core material. Flush doors are most commonly employed in the interior of a dwelling, although slightly more substantial versions are occasionally used as exterior doors, especially within hotels and other buildings containing many independent dwellings.
label: Puertas rasantes @es

Flutes
type: Class
subclass of: Woodwind instruments
comment: A wind instrument consisting of an open cylindrical tube having holes in the side stopped either by the fingers or by pads controlled by keys.
label: Flautas @es

Foam bonding
type: Class
subclass of: Upholstering
comment: This is usually a manual process in which the operator applies the adhesive with a spray gun or a brush. Then the foam is placed manually.
label: Pegado de espuma @es

Foam cutting
type: Class
equivalent class: Restriction
  on property: Performed by
  some values from: Class
    union of: Automatic vertical foam cutting machine
    union of: Band knife machine
    union of: CNC hot wire foam cutting machine
    union of: CNC router system for machining foam
    union of: Portable foam cutting machine
subclass of: Upholstering
label: Corte de espuma @es

Foam mattresses
type: Class
subclass of: Mattresses
comment: A mattress made from one or more layers of foam.
label: Colchones de espuma @es

Foam
type: Class
subclass of: Material supplier
label: Espuma @es

Folding beds
type: Class
subclass of: Beds
subclass of: Restriction
  on property: Has base
  some values from: Bed bases
comment: A bed that can be risen or lowered down, and that has the appearence of a cupboard when it is risen.
label: Camas plegables @es
alternative label: Foldaway beds

Footrests
type: Class
subclass of: Mixed use accessories
comment: A board of wood or metal with a support in a way that forms an inclination angle. It is placed under the tables in order to put the feet on and have a more ergonomic posture.
label: Reposapiés @es
alternative label: Footstools

Formaldehyde adhesives
type: Class
subclass of: Adhesives
label: Adhesivos con formaldehído @es

Four-side sander
type: Class
subclass of: Semi-automatic machines
label: Lijadora de cuatro caras @es

Four sides sanding
type: Class
equivalent class: Restriction
  on property: Performed by
  some values from: Four-side sander
subclass of: Surface preparation
label: Lijado cuatro caras @es

Frames
type: Class
subclass of: Components
comment: The rigid structure of a piece of furniture which makes its shape and forms a support for its parts.
label: Marcos @es

Frame table bases
type: Class
subclass of: Bases
comment: The part of the table that connects the legs to the tabletop. This must be strong and durable to support the weight of the table and the contents placed on it.
label: Bases de mesa @es

French doors
type: Class
subclass of: Doors
comment: Also called a French window, is a door that has multiple windows ("lights") set into it, the full length of the door. Traditional French doors are assembled from individual small pieces of glass and mullions.
label: Ventanas francesas @es

Frying pans
type: Class
subclass of: Kitchen accessories
comment: A large shallow pan with a long handle, used for frying food in.
label: Sartenes @es
alternative label: Skillets

Fume cupboards
type: Class
subclass of: Kitchen accessories
comment: An extraction system used for capturing and removing toxic dust, fumes, aerosol and vapours to minimise exposure to a safe level. It is most commonly found in laboratories, where such substances are handled.
label: Vitrinas de aspiración @es
alternative label: Fume cabinets

Funnels
type: Class
subclass of: Tools
label: Embudos @es

Furnishing
type: Class
subclass of: Processes
comment: To provide something with furniture; to put furniture in a place.
label: Amueblamiento @es

Furniture
type: Class
subclass of: Products
comment: Movable articles, eg tables, chairs or beds, put into a house or an office to make it suitable for living or working in.
label: Mobiliario @es

Furniture accessories
type: Class
subclass of: Furniture
subclass of: Restriction
  on property: Has material
  some values from: Materials
subclass of: Restriction
  on property: Has material
  all values from: Materials
subclass of: Restriction
  on property: Price
  all values from: Price
subclass of: Restriction
  on property: Colour
  some values from: string
subclass of: Restriction
  on property: Description of materials
  some values from: string
subclass of: Restriction
  on property: Certifications
  some values from: string
subclass of: Restriction
  on property: Foldable
  some values from: boolean
subclass of: Restriction
  on property: Stackable
  some values from: boolean
comment: An element or piece of something that can be useful or added as decoration element, but it is not essential.
label: Complementos del mueble @es

Furniture assembly
type: Class
subclass of: Services
label: Montaje de muebles @es

Furniture compositions
type: Class
equivalent class: Class
  intersection of: Furniture
  intersection of: Restriction
    on property: Is composed by
    some values from: Pieces of furniture
subclass of: Furniture
subclass of: Restriction
  on property: Description of materials
  some values from: string
comment: A combination of furniture items to furnish an environment.
comment: Partes o elementos de los que se compone algo. @es
label: Composiciones de mobiliario @es

Furniture cornices
type: Class
subclass of: Components
comment: A molding that crowns a pedestal, a piece of furniture, a building, etc.
label: Cornisas para muebles @es

Crests
type: Class
subclass of: Components
comment: A piece that is placed on top of a countertop next to the wall. It is used to finish the work surface so that it fits against the wall or kitchen cabinets.
label: Copetes @es

Furniture Installer
type: Class
subclass of: Service provider
label: Instalador de Muebles @es

Futon beds
type: Class
subclass of: Beds
comment: A traditional Japanese bedding consisting of a padded mattress, a quilt, and a pillow filled with beans.
label: Camas futon @es

Games tables
type: Class
subclass of: Tables
comment: A table used to play games.
label: Mesas de juego @es

Garbage bins
type: Class
subclass of: Waste containers
comment: A container for household rubbish.
label: Cubos de basura @es
alternative label: Dust bins

Garden benches
type: Class
subclass of: Benches
comment: A garden bench is very similar to a public park bench, but the former offer usually only two or three seats, the latter mostly up to five persons sitting places. In addition, a garden benches may be not fixed at floor.
label: Bancos de jardín @es

Garden chairs
type: Class
subclass of: Outdoor chairs
comment: A light chair made to be used outside.
label: Sillas de jardín @es
alternative label: Lawn chairs

Garden doors
type: Class
subclass of: Doors
comment: Any door that opens to a garden or backyard.
label: Puertas de jardín @es

Garden tables
type: Class
subclass of: Outdoor tables
disjoint with: Picnic tables
comment: A table to be used in gardens or for camping. Very often, garden tables are entirely foldable for easy transport.
label: Mesas de jardín @es
alternative label: Camping tables

Gates
type: Class
subclass of: Industrial protection elements
label: Puertas @es

Gilders
type: Class
subclass of: Tools
label: Doradores @es

Glasses
type: Class
subclass of: Kitchen accessories
comment: A container made out of glass and used for cold drinks.
label: Vasos @es
alternative label: Copas @es

Glass
type: Class
subclass of: Materials
comment: A hard, usually transparent, substance that can break easily.
label: Vidrio @es
alternative label: Cristal @es
alternative label: Crystal

Glass
type: Class
subclass of: Material supplier
label: Cristal @es

Glazers
type: Class
subclass of: Tools
label: Esmaltadores @es

Gliders
type: Class
subclass of: Mixed use accessories
comment: A piece that attaches to the base of a piece of furniture to facilitate its movement on smooth surfaces, such as wood, laminate, or tile floors. Its main function is to reduce friction and protect both the furniture and the floor from damage when moving them.
label: Deslizantes @es

Gluing machine
type: Class
subclass of: Manual machines
label: Encoladora @es

Gluing machine with feeder
type: Class
subclass of: Semi-automatic machines
label: Encoladora con alimentador @es

Glulam timber
type: Class
subclass of: Building timber
label: Madera laminada encolada @es
alternative label: Laminated timber

Gold foil
type: Class
subclass of: Laminated coating materials
label: Pan de oro @es

Granite
type: Class
subclass of: Mineral materials
comment: Hard, usually grey, stone used for building.
label: Granito @es

Griddles
type: Class
subclass of: Household appliances
comment: A round, flat, heavy piece of metal which is placed on a cooker or fire and used for cooking.
label: Planchas @es

Grouping
type: Class
equivalent class: Restriction
  on property: Performed by
  some values from: Carton erector
subclass of: Storage
label: Agrupamiento @es

Guillotine for end grain
type: Class
subclass of: Manual machines
label: Guillotina para testa @es

Guillotine with parallelogram and digital control
type: Class
subclass of: Semi-automatic machines
label: Guillotina con paralelogramo y control digital @es

Guillotine with single edge and spliting piston
type: Class
subclass of: Manual machines
label: Guillotina con pistón de corte a un canto @es

Guitars
type: Class
subclass of: Stringed instruments
comment: A plucked stringed instrument originating in Spain, usually having six strings, a flat sounding board with a circular sound hole in the centre, a flat back, and a fretted fingerboard.
label: Guitarras @es

HORECA Channel
type: Class
subclass of: Manufacturer
label: Canal HORECA @es

Hall
type: Class
subclass of: Furniture compositions
comment: A combination of furniture items to furnish the area just inside the front door, into which some of the other rooms open.
label: Salón @es

Hammers
type: Class
subclass of: Tools
label: Martillos @es

Handles
type: Class
subclass of: Fittings
comment: A part of a door, window, etc by which it is opened.
label: Tiradores @es

Handrails
type: Class
subclass of: Mixed use accessories
comment: A narrow rail that can be held for support, eg when going up or down stairs.
label: Barandillas @es
alternative label: Pasamanos @es

Hangers
type: Class
subclass of: Racks
comment: A curved piece of wood, plastic or wire witha hook at the top, used for hanging a garment in a wardrobe.
label: Perchas @es

Harps
type: Class
subclass of: Stringed instruments
comment: A large triangular plucked stringed instrument consisting of a soundboard connected to an upright pillar by means of a curved crossbar from which the strings extend downwards.
label: Arpas @es

Hat racks
type: Class
subclass of: Racks
comment: A rack for storing hats.
label: Sombrereros @es

Headboards
type: Class
subclass of: Components
comment: A board forming the head of anything, such a bed.
label: Cabeceros @es
alternative label: Cabezal @es

Heaters
type: Class
subclass of: Household appliances
comment: A machine used for making air or water warmer.
label: Estufas @es

Heating installation
type: Class
subclass of: Installation service
label: Instalación de calefacción @es

Height restrictors
type: Class
subclass of: Industrial protection elements
label: Restrictores de altura @es

High chairs
type: Class
subclass of: Children furniture
comment: A children's chair to raise them to the height of adults for feeding. They typically come with a detachable tray so that the child can sit apart from the main table. Booster chairs raise the height of children on regular chairs so they can eat at the main dining table. Some high chairs are clamped directly to the table and thus are more portable.
label: Tronas @es

HDPE (high density polyethylene)
type: Class
subclass of: Thermoplastics
label: HDPE (polietileno alta densidad) @es

HPL
type: Class
subclass of: Laminated coating materials
alternative label: High pressure laminate

Hinges
type: Class
subclass of: Fittings
comment: A small piece of metal, etc on which a lid, door or gate turns or swings as it open or closes.
label: Bisagras @es
alternative label: Pernios @es

Holder shelves
type: Class
subclass of: Fittings
comment: A threaded bracket to hold and support shelves in.
label: Portaestantes @es

Home
type: Class
subclass of: Manufacturer
label: Hogar @es

Home student desks
type: Class
subclass of: Domestic tables
comment: Any desk form meant for use by a student. Usually the term designates a small pedestal desk or writing table constructed for use by a teenager or a pre-teen in his or her room at home.
label: Escritorios de estudiante @es

Home textiles
type: Class
subclass of: Products
subclass of: Restriction
  on property: Breathable
  some values from: boolean
subclass of: Restriction
  on property: Machine washable
  some values from: boolean
comment: A textile component used in the domestic environment.
label: Textiles de hogar @es

Honeycomb
type: Class
subclass of: Cardboard
label: Nido de abeja @es

Hooks
type: Class
subclass of: Racks
comment: A bent piece of metal or plastic that is used for catching or holding things, or for hanging things up.
label: Ganchos @es

Hook ladders
type: Class
subclass of: Ladders
comment: A rigid ladder with a hook at the top to grip a windowsill. It is used by firefighters.
label: Escaleras de gancho @es

Horizontal inferior band sander
type: Class
subclass of: Automatic machines
label: Lijadora horizontal inferior @es

Horizontal rip saw
type: Class
subclass of: Semi-automatic machines
label: Seccionadora horizontal de un corte @es

Horizontal rip saw with feeding
type: Class
subclass of: Automatic machines
label: Seccionadora horizontal de un corte con alimentador @es

Horizontal superior band sander
type: Class
subclass of: Automatic machines
label: Lijadora horizontal superior @es

Horizontal surfaces
type: Class
subclass of: Components
comment: A flat surface perpendicular to the ground.
label: Superficies horizontales @es

Horns
type: Class
subclass of: Brass instruments
comment: A brass musical instrument that consists of a long tube curled around in a circle with a wide opening at the end.
label: Trompas @es

Hoses
type: Class
subclass of: Mixed use accessories
comment: A long, flexible pipe made of rubber or plastic. Water is directed through a hose in order to do things such as put out fires, clean cars, or water gardens.
label: Mangueras @es

Hospital beds
type: Class
subclass of: Beds
comment: A specifically designed bed to facilitate convalescence, traditionally in a hospital or nursing facility, but increasingly in other settings, such as a private residence. Modern hospital beds commonly have wheels to assist in moderate relocation, but they are larger and generally more permanently placed than a gurney. They often have electric and manual positioning of mattress for therapeutical use.
label: Camas de hospital @es

Hot air drying
type: Class
subclass of: Techniques
label: Secado por aire caliente @es

Hot air drying tunnel
type: Class
equivalent class: Restriction
  on property: Employs
  some values from: Hot air drying
subclass of: Drying tunnel
label: Cámara de secado de aire caliente @es

Hot-melt adhesives
type: Class
subclass of: Adhesives
label: Adhesivos Hot Melt (termofusible) @es

Hot shrinking baler
type: Class
subclass of: Semi-automatic machines
label: Embaladora termo retráctil @es

Hot shrinking packaging
type: Class
subclass of: Techniques
label: Embalaje termoretráctil @es

Household appliances
type: Class
subclass of: Products
comment: An electrical instrument or device por domestic use.
label: Electrodomésticos @es
alternative label: Domestic appliances
alternative label: White goods

Hurdy-gurdies
type: Class
subclass of: Stringed instruments
comment: A medieval instrument shaped like a viol in which a rosined wheel rotated by a handle sounds the strings.
label: Organillos @es
alternative label: Zanfoñas @es

Hydraulic press with double plate
type: Class
subclass of: Manual machines
label: Prensa hidráulica de dos platos @es

Hydraulic press with double plate, feeding belt and downloading
type: Class
subclass of: Semi-automatic machines
label: Prensa hidráulica de dos platos con banda de alimentación y descarga @es

Hydraulic screw press for moulds
type: Class
subclass of: Manual machines
label: Prensa de husillos hidráulicos para moldes @es

Hydraulic screw press for moulds with high frequency drying
type: Class
subclass of: Manual machines
label: Prensa de husillos hidráulicos para moldes de secado por alta frecuencia @es

Hygrometers
type: Class
subclass of: Measuring instruments
label: Higrómetros @es

Ice cube dispensers
type: Class
subclass of: Household appliances
comment: An appliance with a water source that makes and distributes ice cubes.
comment: Un aparato que dispone de una fuente de agua para fabricar y proporcionar cubitos de hielo. @es
label: Dispensadores de cubitos de hielo @es

Immersion application
type: Class
subclass of: Techniques
label: Aplicación por inmersión @es

In-house services
type: Class
subclass of: Logistics services
comment: Work or activitiy done by employees of an organization or company, rather than by workers outside the organization or company.
label: Servicios in-house @es

Industrial burners
type: Class
subclass of: Tools
label: Quemadores industriales @es

Machines
type: Class
subclass of: Products
comment: A power-driven device that processes materials through various methods such as cutting, forming, or applying pressure.
label: Máquinas @es

Industrial protection elements
type: Class
subclass of: Auxiliary equipment
label: Protecciones industriales @es

Industrial scales
type: Class
subclass of: Tools
label: Básculas industriales @es

Infrared drying
type: Class
subclass of: Techniques
label: Secado por infrarrojos @es

Infrared tunnel for varnished flat pieces
type: Class
equivalent class: Restriction
  on property: Employs
  some values from: Infrared drying
subclass of: Drying tunnel
label: Túnel de infrarrojos para piezas planas barnizadas @es

Installation service
type: Class
subclass of: Services
comment: The action or process of installing somebody or something.
label: Servicio de instalación @es

Interior design
type: Class
subclass of: Services
label: Decoración de interiores @es

Design / Decoration
type: Class
subclass of: Service provider
label: Diseño / Interiorismo @es

Iron
type: Class
subclass of: Metal materials
comment: A hard strong metal that is used to make steel and is also found in small quantities in blood and food.
label: Hierro @es

Ironing boards
type: Class
subclass of: Work tables
comment: A board, usually on legs, with a suitable covering on which to iron clothes.
label: Tablas de planchar @es

Kitchen islands
type: Class
subclass of: Domestic tables
comment: An extra work surface used to prepare food.
comment: Superficie extra de trabajo que se utiliza para preparar comida. @es
label: Islas de cocina @es

Jewel cases
type: Class
subclass of: Storage pieces of furniture
comment: A special box for keeping jewels in.
label: Joyeros @es

Juicers
type: Class
subclass of: Household appliances
subclass of: Kitchen accessories
comment: A piece of electrical equipment for getting the juice out of fruit or vegetables.
label: Exprimidores @es
label: Squeezers

Jute fibre
type: Class
subclass of: Natural fibre
label: Fibra de yute @es

Kerb barriers
type: Class
subclass of: Industrial protection elements
label: Zócalos de seguridad @es

Kettledrums
type: Class
subclass of: Percussion instruments
comment: A large metal drum with a round bottom and a thin plastic top that can be made looser or tighter to produce different musical notes. A set of kettledrums is usually called timpani.
label: Timbales @es

Keys
type: Class
subclass of: Fittings
comment: A piece of metal with a special shape used for locking a door, starting a car, etc.
label: Llaves @es

Keyboard instruments
type: Class
subclass of: Musical instruments
comment: A musical instrument played using a keyboard, a row of levers that are pressed by the fingers.
label: Instrumentos de teclas @es

Keyholes
type: Class
subclass of: Fittings
comment: The hole in a lock that you put a key.
label: Bocallaves @es

Kids
type: Class
subclass of: Manufacturer
label: Mueble Juvenil @es

Kitchen accessories
type: Class
subclass of: Furniture accessories
comment: An accessory for the kitchen.
label: Accesorios de cocina @es

Kitchen bins
type: Class
subclass of: Waste containers
comment: A bin which is traditionally kept in the kitchen to dispose of culinary excess such as fruit peelings or food packets.
label: Papeleras de cocina @es

Kitchen cabinets
type: Class
subclass of: Cabinets
comment: The built-in furniture installed in many kitchens for storage of food, cooking equipment, and often silverware and dishes for table service. Appliances such as refrigerators, dishwashers, and ovens are often integrated into kitchen cabinetry.
label: Armarios de cocina @es

Kitchen chairs
type: Class
subclass of: Domestic chairs
comment: A chair that is usually smaller in scale and more versatile in its design than a dining chair.
label: Sillas de cocina @es

Kitchen clothes
type: Class
subclass of: Kitchen textiles
comment: A towel for drying dishes and kitchen utensils.
label: Paños de cocina @es
alternative label: Tea clothes
alternative label: Tea towels

Kitchen
type: Class
subclass of: Furniture compositions
comment: A combination of furniture items to furnish a room or building in which meals are cooked or prepared.
label: Cocina @es

Kitchen
type: Class
subclass of: Manufacturer
label: Cocina @es

Kitchen tables
type: Class
subclass of: Domestic tables
comment: A piece of furniture commonly found in kitchens, used for dining, food preparation, or other everyday activities
label: Mesas de cocina @es

Kitchen textiles
type: Class
subclass of: Home textiles
comment: A textile product used in the kitchen.
label: Textiles de cocina @es

Kitchen workbenches
type: Class
subclass of: Work tables
comment: A thick wooden boardwork used to add functionality in a kitchen.
label: Bancos de cocina @es

Kitchen worktops
type: Class
subclass of: Domestic tables
comment: A long surface of wood, granite, marble, etc used to work at in the kitchen.
label: Encimeras @es
alternative label: Countertops
alternative label: Kitchen benches
alternative label: Worktop

Kneelers
type: Class
subclass of: Religious benches
comment: A low, often cushioned, support that worshipers in a church, chapel, etc. can fold down and kneel upon.
label: Reclinatorios @es

Knobs
type: Class
subclass of: Fittings
comment: A round handle, especially of a door or drawer.
label: Pomos @es

Kraft paper
type: Class
subclass of: An envelope that protects goods during transportation.
comment: A strong, usually brown paper processed from wood pulp, used chiefly for bags and as wrapping paper.
comment: Un papel resistente, generalmente marrón, elaborado a partir de pulpa de madera, utilizado principalmente para bolsas y como papel de envolver. @es
label: Papel Kraft @es
label: Papel de estraza @es

Kraft paper with bubbles
type: Class
subclass of: An envelope that protects goods during transportation.
comment: A composite of kraft paper and bubble wrap that combines the strength of Kraft paper with the lightness of air bubbles, creating a protective film around fragile or surface-sensitive products.
comment: Un compuesto de papel kraft y plástico de burbujas que combina la resistencia del papel Kraft con la ligereza de las burbujas de aire que crean una película protectora alrededor de los productos frágiles o sensibles a la superficie. @es
label: Papel Kraft con burbujas @es

Kraft paper with PE/foam
type: Class
subclass of: An envelope that protects goods during transportation.
comment: A composite of a clean, lightweight polyethylene foam and a kraft paper layer designed to protect any surface.
comment: Un compuesto de una espuma de polietileno limpia y ligera y una capa de papel Kraft diseñada para proteger cualquier superficie. @es
label: Papel Kraft con PE/espuma @es

Labelling
type: Class
subclass of: Storage
comment: This is a manual process that consists of the identification of the different packages printing and sticking identification labels.
label: Etiquetado @es

Laboratory benches
type: Class
subclass of: Work tables
comment: A customized table crafted to support various lab tasks and experiments, including the management of reagents and test specimens.
label: Mesas de laboratorio @es

Laboratory cabinets
type: Class
subclass of: Cabinets
comment: A piece of furniture consisting of cupboars and/or shelves and/or drawers, intented for the storage of laboratory.
label: Armarios de laboratorio @es

Laces
type: Class
subclass of: Mixed use textiles
comment: A thin piece of material that is put through special holes in some types of clothing, especially shoes. The laces are tied together in order to tighten the clothing.
label: Cordones @es
alternative label: Cords

Lacquering
type: Class
equivalent class: Restriction
  on property: Performed by
  some values from: Class
    union of: Aerographic application robot
    union of: Curtain coating machine
    union of: Roller machine
    union of: Spray application gun
subclass of: Finishing
comment: This process applies some product to the piece to colour it.
label: Lacado @es

Ladders
type: Class
subclass of: Mixed use accessories
comment: A structure for climbing up and down something, consisting of two upright lengths of wood, metal or rope joined to each other by short pieces of wood, etc used as steps.
label: Escaleras @es

Laminated coating materials
type: Class
subclass of: Materials
comment: A material that can be constructed by joining two or more layers of material and is used for coating.
label: Materiales laminados de revestimiento @es

Latches
type: Class
subclass of: Fittings
comment: A small metal bar that is used to fasten a door or a gate. You raise it to open the door and drop it to fasten it.
label: Pestillos @es
alternative label: Fallebas @es

Latex
type: Class
subclass of: Paddings
label: Látex @es

Latex mattresses
type: Class
subclass of: Mattresses
comment: A mattress that is crafted from latex foam, which can come from natural sources (like rubber tree sap) or be produced synthetically.
label: Colchones de látex @es

Lathing
type: Class
equivalent class: Restriction
  on property: Performed by
  some values from: Class
    union of: CNC automatic lathe
    union of: Manual copying lathe
    union of: Manual lathe
    union of: Semi-automatic lathe
subclass of: Machining operation
label: Torneado @es

Lattices
type: Class
subclass of: Mixed use accessories
comment: A framework of crossed bars with space between, used eg as a screen, fence or or support for climbing plants.
label: Celosías @es

Leather
type: Class
subclass of: Upholstery materials
comment: A material made from animal skins treated by a special process.
label: Cuero @es

Led kit
type: Class
subclass of: Lighting
comment: A pre-packaged set of LEDs (Light-Emitting Diode) and everything needed to set up a LED lighting system.
label: Kit led @es

Legs
type: Class
subclass of: Bases
comment: The part of a piece of furniture (e.g., table, chair) that rest on the floor and supports the furniture's weight.
label: Patas @es

Legal Services
type: Class
subclass of: Service provider
label: Servicios Jurídicos @es

Legal services
type: Class
subclass of: Services
label: Servicios legales @es

Lighting
type: Class
subclass of: Products
comment: A device to provide artificial illumination to create a certain atmosphere, to highlight a particular feature, or to simply provide visibility.
label: Iluminación @es

Lightings / Lamps
type: Class
subclass of: Manufacturer
label: Iluminación / Lámparas @es

Lignocellulosic materials
type: Class
subclass of: Materials
label: Materiales lignocelulósicos @es

Linen
type: Class
subclass of: Lignocellulosic materials
label: Lino @es

Loading
type: Class
subclass of: Processes
comment: The act of placing a load or goods in or onto a means of transport.
label: Carga @es

Locks
type: Class
subclass of: Fittings
comment: A device which is used to keep it shut and prevent other people from opening it. Locks are opened with a key.
label: Cerraduras @es

Locker r oom bench
type: Class
subclass of: Benches
comment: A bench that provides a convenient and organized space where users can change and store belongings.
label: Banco de vestuario @es
alternative label: Changing room benches

Logistics consultancy
type: Class
subclass of: Logistics services
comment: A service focused on evaluating, designing, and implementing effective logistics solutions for companies.
label: Consultoría logística @es

Logistics operator
type: Class
subclass of: Supplier
label: Operador logístico @es

Logistics services
type: Class
subclass of: Services
comment: A service related to the management of transportation of information or goods from one place to another.
label: Servicios logísticos @es

Long cutting
type: Class
equivalent class: Restriction
  on property: Performed by
  some values from: Class
    union of: Double blade mitre saw
    union of: Numerical control double blade mitre saw
    union of: Single blade mitre saw
subclass of: Machining operation
label: Corte de largo @es

Long cutting of plates
type: Class
equivalent class: Restriction
  on property: Performed by
  some values from: Guillotine for end grain
subclass of: Quartering
label: Corte largo paquete de chapas @es

Long pants
type: Class
subclass of: Personal protective equipment
label: Pantalones largos @es

Long sleeve shirts
type: Class
subclass of: Personal protective equipment
label: Camisas de manga larga @es

Lounge tables
type: Class
subclass of: Domestic tables
comment: A table designed to serve unique or specific functions within the lounge.
label: Mesas de salón @es

Louver doors
type: Class
subclass of: Doors
comment: A door that has fixed or movable wooden fins (often called slats or louvers) which permit open ventilation whilst preserving privacy and preventing the passage of light to the interior. Being relatively weak structures, they are most commonly used for wardrobes and drying rooms, where security is of less importance than good ventilation.
label: Persianas @es

Loveseats
type: Class
subclass of: Sofas
comment: A small upholstered sofa for two people.
label: Sofás biplaza @es

Low benches
type: Class
subclass of: Benches
comment: A small and not high bench used to be sit on, to put on the feet, etc.
label: Bancos bajos @es

Lurex fabric
type: Class
subclass of: Synthetic fabric
label: Tejido de lurex @es

Lutes
type: Class
subclass of: Stringed instruments
comment: An ancient plucked stringed instrument, consisting of a long fingerboard with frets and gut strings, and a body shaped like a sliced pear.
label: Laúdes @es

Lyres
type: Class
subclass of: Stringed instruments
comment: An ancient Greek stringed instrument consisting of a resonating tortoise shell to which a crossbar was attached by two projecting arms. It was plucked with a plectrum and used for accompanying songs.
label: Liras @es

MDF boards
type: Class
subclass of: Wooden boards
comment: Medium Density Fibreboard - a panel material made from reconstituted wood fibre and bonded with a resin. Has a smooth surface and is widely used in modern cabinet furniture. It has a homogeneous density throughout all its thickness.
label: Tableros MDF @es
alternative label: Tableros DM @es

Machinery
type: Class
subclass of: Material supplier
label: Maquinaria @es

Machining operation
type: Class
subclass of: Processes
label: Mecanizado @es

Magazine racks
type: Class
subclass of: Racks
comment: A rack for storing magazines and newspapers.
label: Revisteros @es

Mahogany wood
type: Class
subclass of: Wood
comment: A hard reddish-brown wood used esp for making furniture. Its texture is fine, although it can be interlaced. Its grain can vary from fine to medium.
label: Madera de caoba @es

Facility Maintenance
type: Class
subclass of: Service provider
label: Mantenimiento Instalaciones @es

Mallets
type: Class
subclass of: Tools
label: Mazos @es
alternative label: Mazas @es

Mandolins
type: Class
subclass of: Stringed instruments
comment: A plucked stringed instrument related to the lute, having four pairs of strings tuned in ascending fifths stretched over a small light body with a fretted fingerboard.
label: Mandolinas @es

Manual copying lathe
type: Class
subclass of: Manual machines
label: Torno copiador manual @es

Manual cutting machine
type: Class
subclass of: Manual machines
label: Cortadora manual @es

Manual lathe
type: Class
subclass of: Manual machines
label: Torno manual @es

Manual machines
type: Class
subclass of: Machines
label: Máquinas manuales @es

Manual polisher
type: Class
subclass of: Manual machines
label: Pulidora manual @es

Manual press for drawers assembly
type: Class
subclass of: Manual machines
label: Prensa manual para montaje de cajones @es

Manual press for module assembly
type: Class
subclass of: Manual machines
label: Prensa manual para montaje de módulos @es

Manual sander for curved pieces
type: Class
subclass of: Manual machines
label: Lijadora manual para piezas curvas @es

Manual sander for edges and shaped pieces
type: Class
subclass of: Manual machines
label: Lijadora para cantos y piezas con forma @es

Manual sanding
type: Class
subclass of: Surface preparation
label: Lijado manual @es

Manufacturer
type: Class
subclass of: Organization
comment: A person or organization that makes products, especially in a factory.
label: Fabricante @es

Maple wood
type: Class
subclass of: Wood
comment: Acasia tree, the colour of its wood is white or fair yellow. Its texture is fine or smooth.
label: Madera de arce @es

Maracas
type: Class
subclass of: Percussion instruments
comment: A pair of simple musical instruments consisting of hollow balls containing beads or beans that are shaken to produce a sound.

Marble
type: Class
subclass of: Mineral materials
comment: A hard, usually white, stone, often with dark veins, which can be highly polished.
label: Mármol @es

Marimbas
type: Class
subclass of: Percussion instruments
comment: A Latin American percussion instrument consisting of a set of hardwood plates placed over tuned metal resonators, played with two soft-headed sticks in each hand.

Maritime transport
type: Class
subclass of: Transport
comment: A service for of taking goods or people from one place to another by sea.
label: Transporte marítimo @es

Masks
type: Class
subclass of: Personal protective equipment
comment: They have different filters for sanding or varnishing.
label: Máscaras @es

Mats
type: Class
subclass of: Mixed use accessories
comment: A small piece of material placed under a hot dish, or a glass, plate, etc to protect the surface underneath.
label: Esteras @es

Materials
type: Class
subclass of: Restriction
  on property: Composition
  some values from: string
subclass of: Restriction
  on property: Special effects
  some values from: string
subclass of: Restriction
  on property: Antibacterial
  some values from: boolean
subclass of: Restriction
  on property: Fireproof
  some values from: boolean
subclass of: Restriction
  on property: Waterproof
  some values from: boolean
comment: A material from which something else is or can be made.
label: Materiales @es

Material supplier
type: Class
subclass of: Supplier
label: Proveedor de material @es

Mattresses
type: Class
subclass of: Mixed use accessories
subclass of: Restriction
  on property: Removable cover
  some values from: boolean
subclass of: Restriction
  on property: Antibacterial
  some values from: boolean
subclass of: Restriction
  on property: Breathable
  some values from: boolean
comment: A stong cloth case filled with soft or firm material and used for sleeping on. Some mattresses also contain springs.
label: Colchones @es

Mattress bases
type: Class
subclass of: Components
comment: The structure that acts as a lower support upon which the mattress is placed. Its main function is to provide stability, durability, and ventilation.
label: Somieres @es

Mattress covers
type: Class
subclass of: Bed linen
comment: A bedding item designed to cover and protect the mattress across its entire surface, from the base to the corners.
comment: Case for the mattress.
label: Fundas de colchón @es
alternative label: Mattress cases

Mattresses
type: Class
subclass of: Manufacturer
label: Colchones @es

Mattress protectors
type: Class
subclass of: Bed linen
comment: A textile accessory that is placed directly on the mattress, whose main function is to protect the surface of the mattress from spills, sweat, stains and dust mites, keeping it clean for longer.
label: Protectores de colchón @es

Measuring instruments
type: Class
subclass of: Auxiliary equipment
label: Instrumentos de medición @es

Medicine chests
type: Class
subclass of: Chests
comment: A chest used especially for the storing of medicines or first-aid supplies.
label: Botiquines @es

MF (melamine-formaldehyde)
type: Class
subclass of: Formaldehyde adhesives
label: MF (melamina-formaldehído) @es

Melamine paper
type: Class
subclass of: Laminated coating materials
comment: A type of plastic used especially as a covering for other materials, normally for furniture.
label: Papel de melamina @es

Membrane press
type: Class
subclass of: Manual machines
label: Prensa de membrana @es

Membrane press with feeding and downloading
type: Class
subclass of: Semi-automatic machines
label: Prensa de membrana con alimentación y descarga @es

Metal coating
type: Class
subclass of: Chemical substances
label: Recubrimiento metálico @es
alternative label: Metallic coating

Metal materials
type: Class
subclass of: Materials
label: Materiales metálicos @es
alternative label: Metallic materials

Metal structures
type: Class
subclass of: Structures
comment: A structural element, primarily made of steel and other strong metals, used to support loads and provide stability. These structures are composed of elements such as beams, columns, trusses, and purlins, which are assembled to form a solid and resistant structure.
label: Estructuras metálicas @es
alternative label: Metallic structures

Metal
type: Class
subclass of: Material supplier

Microwave application
type: Class
subclass of: Techniques
label: Aplicación por microondas @es

Microwave ovens
type: Class
subclass of: Household appliances
comment: An appliance that generates high-frequency waves to quickly heat or cook food.
comment: Un dispositivo que genera ondas de alta frecuencia para calentar o cocinar alimentos rápidamente. @es
label: Hornos microondas @es

Microwave tunnel for varnished flat pieces
type: Class
equivalent class: Restriction
  on property: Employs
  some values from: Microwave application
subclass of: Drying tunnel
label: Túnel de microondas para piezas planas barnizadas @es

Milling machine
type: Class
subclass of: Semi-automatic machines
label: Retestadora @es

Mineral materials
type: Class
subclass of: Materials
label: Materiales minerales @es

Mirrors
type: Class
subclass of: Mixed use accessories
comment: A shiny surface, usually of specially treated glass or metal, that reflects images.
label: Espejos @es

Mirror frames
type: Class
subclass of: Frames
comment: A frame for furniture pieces like mirrors, blackboard, etc.
label: Marcos de espejo @es

Mixed use accessories
type: Class
subclass of: Furniture accessories
comment: An accessory for mixed use.
label: Accesorios de uso mixto @es

Mixed use textiles
type: Class
subclass of: Home textiles
comment: A textile product that can be used in various rooms.
label: Textiles de uso mixto @es

Modular sofas
type: Class
subclass of: Sofas
comment: A sofa that comprises individual sections that can be slotted together or taken apart and rearranged to provide a seating solution for a room.
label: Sofás modulares @es

Mops
type: Class
subclass of: Cleaning accessories
comment: A piece of equipment for washing floors. It consists of a sponge or many pieces of string attached to a long handle.
label: Fregonas @es
alternative label: Mochos @es

Mortising
type: Class
equivalent class: Restriction
  on property: Performed by
  some values from: Class
    union of: Mortising machine with double drill and pneumatic movement
    union of: Mortising machine with manual head
    union of: Multiple mortising machine
    union of: Numerical control multiple mortising machine
subclass of: Machining operation
label: Escopleado @es

Mortising machine with double drill and pneumatic movement
type: Class
subclass of: Semi-automatic machines
label: Escopleadora de dos taladros y desplazamiento neumático @es

Mortising machine with manual head
type: Class
subclass of: Manual machines
label: Escopleadora con cabezal manual @es

Moses basket
type: Class
subclass of: Children furniture
comment: A traditional, portable basket designed for infants to sleep in.
label: Moisés @es

Mosquito nets
type: Class
subclass of: Mixed use accessories
comment: A net hung over a bed, etc. to keep mosquitoes out.
label: Mosquiteras @es

Mould making
type: Class
subclass of: Machining operation
label: Moldurado @es

Mouldings
type: Class
subclass of: Components
comment: A line of ornamental plaster, carved wood, moulded plastic, etc., typically around the edge or along the top of something.
label: Molduras @es

Moulding sanding
type: Class
equivalent class: Restriction
  on property: Performed by
  some values from: Class
    union of: Multiple belt sander
    union of: Single head sander for mouldings
    union of: Vertical band sander for simple curves
subclass of: Surface preparation
label: Lijado de molduras @es

Multi-axial moulding machine
type: Class
subclass of: Manual machines
label: Moldurera de ejes múltiples @es

Multi-axial moulding machine with feeding
type: Class
subclass of: Semi-automatic machines
label: Moldurera de ejes múltiples con alimentador @es

Multiple belt sander
type: Class
subclass of: Semi-automatic machines
label: Lijadora de múltiples cintas @es

Multiple drill
type: Class
subclass of: Manual machines
label: Taladradora múltiple @es

Multiple mortising machine
type: Class
subclass of: Semi-automatic machines
label: Escopleadora múltiple @es

Multiple side planer
type: Class
subclass of: Semi-automatic machines
label: Cepilladora de múltiples caras @es

Musical accessories
type: Class
subclass of: Musical instruments
comment: A utensil that complements a musical instrument, whether to make it sound better, to make it more comfortable, to protect it, or to ensure that it functions properly.
label: Accesorios musicales @es

Musical instruments
type: Class
subclass of: Products
comment: An object to play in order to produce music.
label: Instrumentos musicales @es

Nails
type: Class
subclass of: Basic assembly hardware
comment: A small thin pointed piece of metal with a flat head, used for joining pieces of wood together or hanging things on a wall.
label: Clavos @es

Natural fibre
type: Class
subclass of: Upholstery materials
label: Fibra natural @es

Net curtains
type: Class
subclass of: Curtains
comment: A small curtain placed on the inside of windows to protect from the sun or prevent the view from outside.
label: Visillos @es

Notice boards
type: Class
subclass of: Table tops
disjoint with: Writing boards
comment: A board bearing a notice or on which notices may be posted (as at a school).
label: Tablones de anuncios @es
alternative label: Bulletin boards

Nozzles
type: Class
subclass of: Tools
label: Boquillas @es

Numerical control double blade mitre saw
type: Class
subclass of: CNC machines
label: Tronzadora de dos cabezales de control numérico @es

Numerical control double edge bander
type: Class
subclass of: CNC machines
label: Chapadora doble de control numérico @es

Numerical control double head tenoning
type: Class
subclass of: CNC machines
label: Espigadora de doble cabezal de control numérico @es

Numerical control double head tenoning with supply
type: Class
subclass of: CNC machines
label: Espigadora de doble cabezal de control numérico con alimentador @es

Numerical control drilling machine with multiple heads, feeder and downloading
type: Class
subclass of: CNC machines
label: Taladradora de múltiples cabezales con alimentador y descarga de control numérico @es

Numerical control edge bander
type: Class
subclass of: CNC machines
label: Chapadora de control numérico @es

Numerical control moulding machine
type: Class
subclass of: CNC machines
label: Moldurera de control numérico @es

Numerical control multiple mortising machine
type: Class
subclass of: CNC machines
label: Escopleadora múltiple de control numérico @es

Numerical control spindle moulder
type: Class
subclass of: CNC machines
label: Tupí de control numérico @es

Nursing chair pockets
type: Class
subclass of: Mixed use textiles
comment: An accessory to transport the baby bottle comfortably, allowing it to stay at a good temperature for a few hours.
label: Portabiberones @es

Nursing rocking chairs
type: Class
subclass of: Children furniture
comment: A chair that's comfortable when nursing an infant. It differs from a rocking chair in that it does not have rockers, but rather four stationary legs.
label: Mecedoras de lactancia @es

Nuts
type: Class
subclass of: Basic assembly hardware
subclass of: Restriction
  on property: Nut type
  some values from: string
comment: A type of fastener with a threaded hole. Nuts are almost always used in conjunction with a mating bolt to fasten multiple parts together. The two partners are kept together by a combination of their threads' friction (with slight elastic deformation), a slight stretching of the bolt, and compression of the parts to be held together. The term "screw" is sometimes used to refer also nuts.
label: Tuercas @es

Nylon
type: Class
subclass of: Thermoplastics

Nylon fabric
type: Class
subclass of: Synthetic fabric
label: Tejido de nylon @es

OSB boards
type: Class
subclass of: Wooden boards
label: Tableros OSB @es

Oak wood
type: Class
subclass of: Wood
comment: A tree with tough hard wood. Its colour can vary from the brownish-yellow to brown. It has coarse grain.
label: Madera de roble @es

Oboes
type: Class
subclass of: Woodwind instruments
comment: A woodwind instrument consisting of a conical tube fitted with a mouthpiece having a double reed. It has a penetrating nasal tone.

Ocarinas
type: Class
subclass of: Flutes
comment: An egg-shaped wind instrument with a protruding mouthpiece and six to eight finger holes, producing an almost pure tone.

Office chairs
type: Class
subclass of: Chairs
comment: A type of chair that is designed for use at a desk in an office.
label: Sillas de oficina @es

Office
type: Class
subclass of: Furniture compositions
comment: A combination of furniture items to furnisha room or a part of a building where people work sitting at desks.
label: Oficina @es

Office desks
type: Class
subclass of: Office tables
comment: A piece of furniture with a flat or sloping top and often with drawers, at which one can read, write or work. Normally used in offices.
label: Escritorios de oficina @es

Office
type: Class
subclass of: Manufacturer
label: Oficina @es

Office tables
type: Class
subclass of: Tables
comment: A table used for working in offices.
label: Mesas de oficina @es

Oils
type: Class
subclass of: Auxiliary substances
label: Aceites @es
alternative label: Grasas @es
alternative label: Lubricantes

Olive wood
type: Class
subclass of: Wood
comment: Tree with yellow wood and with redish veins. It has irregular fiber that can be entwined. It has fine grain.
label: Madera de olivo @es

Operating tables
type: Class
subclass of: Work tables
comment: A table which a patient in a hospital lies on during a surgical operation.
label: Mesas de operaciones @es

Order picking
type: Class
subclass of: Logistics services
comment: A service consisting of taking goods that have been ordered from the place where they are stored and sending them to customers.
label: Recogida de pedidos @es

Organs
type: Class
subclass of: Keyboard instruments
comment: A large musical instrument with keys like a piano. Sounds are produced by air forced through pipes.
label: Órganos @es

Organization
type: Class
subclass of: Restriction
  on property: Address
  some values from: string
subclass of: Restriction
  on property: Awards
  some values from: string
subclass of: Restriction
  on property: Business activity code
  some values from: string
subclass of: Restriction
  on property: Company name
  some values from: string
subclass of: Restriction
  on property: E-mail
  some values from: string
subclass of: Restriction
  on property: VAT identifier
  some values from: string
subclass of: Restriction
  on property: Website
  some values from: string
subclass of: Restriction
  on property: Certifications
  some values from: string
comment: A body composed of individual people and/or legal entities, having an orderly structure to fulfil a purpose, especially a business, government department, charity, etc.
label: Organización @es
alternative label: Company
alternative label: Compañia @es
alternative label: Enterprise

Ortophedic chairs
type: Class
subclass of: Chairs
comment: A char that is specially designed to support the spine, lower back, and overall body posture.
label: Sillas ortopédicas @es

Oscillating window
type: Class
subclass of: Windows
comment: A window that can be opened by rotating horizontally, leaving a small opening at the top that is usually used to ventilate the room while taking up minimal space, or even to prevent drafts.
label: Ventana oscilante @es

Other alloys
type: Class
subclass of: Metal materials
label: Otras aleaciones @es

Outdoor chairs
type: Class
subclass of: Chairs
comment: A chair that is designed for use outdoors.
label: Sillas de exterior @es

Outdoor equipment
type: Class
subclass of: Products
comment: A product designed for outdoor activities.
label: Equipamiento de exterior @es

Outdoor fitness equipment
type: Class
subclass of: Outdoor equipment
comment: Equipment designed for a fitness area built outside in a public park, with the all-weather construction of its exercise machines somewhat modeled on playground equipment.
label: Equipamiento deportivo de exterior @es
alternative label: Outdoor gym equipment

Outdoor Furniture
type: Class
subclass of: Manufacturer
label: Mueble para Exteriores @es

Outdoor stove heaters
type: Class
subclass of: Household appliances
comment: A stove designed to emit direct heat and maintain the temperature in open or semi-covered areas.
label: Estufas de exterior @es

Outdoor tables
type: Class
subclass of: Tables
comment: A table to be used outdoors. Outdoor tables may be intended for contract use (non-private use in places with public access, such as restaurants, open-air swimming pools, vacational an leisure sites), domestic use (gardens, wintergardens, terraces, balconiest, etc) and camping use. Outdoor tables for camping use are often foldable or detachable and of light-weight design.
label: Mesas de exterior @es

Ovens
type: Class
subclass of: Household appliances
comment: A closed device equipped with an upper heating element (broiler) and a lower heating element, in which food is cooked or heated.
comment: Un dispositivo cerrado equipado con un elemento calefactor en la parte superior (parrilla) y un elemento calefactor inferior, donde la comida es cocinada o calentada. @es
label: Hornos @es

Oven gloves
type: Class
subclass of: Kitchen textiles
comment: A heatproof glove or mitt used to carry or take hot trays, dishes, etc out of the oven.
label: Manoplas @es

Packaging
type: Class
equivalent class: Restriction
  on property: Performed by
  some values from: Class
    union of: Film baler
    union of: Hot shrinking baler
subclass of: Storage
label: Embalaje @es
alternative label: Empaque @es
alternative label: Packing

Packaging Materials
type: Class
subclass of: Material supplier
label: Materiales de Embalaje @es

Paddings
type: Class
subclass of: Upholstery materials
label: Rellenos @es
alternative label: Fills

Paints
type: Class
subclass of: Coating substances
subclass of: Restriction
  on property: Base of substance
  some values from: string
subclass of: Restriction
  on property: Magnetic
  some values from: boolean
subclass of: Restriction
  on property: Phosphorescent
  some values from: boolean
subclass of: Restriction
  on property: Solvent-based
  some values from: boolean
subclass of: Restriction
  on property: Water-based
  some values from: boolean
label: Pinturas @es

Paint strippers
type: Class
subclass of: Auxiliary substances
label: Decapantes @es

Paints / Varnishes
type: Class
subclass of: Material supplier
label: Pinturas / Barnices @es

Palette knives
type: Class
subclass of: Tools
comment: A palette knife is usually rubber and steel made.
label: Espátulas @es

Pallets
type: Class
subclass of: Tertiary packaging
subclass of: Restriction
  on property: EPAL certificate
  some values from: boolean
subclass of: Restriction
  on property: Flap
  some values from: boolean
subclass of: Restriction
  on property: ISPM-15 certificate
  some values from: boolean
subclass of: Restriction
  on property: Skate
  some values from: boolean
subclass of: Restriction
  on property: Reversible
  some values from: boolean
comment: A flat wooden or metal platform on which goods are stored so that they can be lifted and moved using a forklift truck.
comment: Una plataforma plana de madera o metal sobre la que se almacenan las mercancías para que puedan ser levantadas y trasladadas con una carretilla elevadora. @es
alternative label: Paletas @es

Panel doors
type: Class
subclass of: Doors
comment: A type of door constructed with multiple panels that are typically rectangular or square in shape.
label: Puertas de panel @es

Panels
type: Class
subclass of: Manufacturer
label: Paneles @es

Paper
type: Class
subclass of: Lignocellulosic materials
label: Papel @es

Paper filling
type: Class
subclass of: Cushion packaging
comment: A type of packing material used to fill and protect items during shipping or storage. It is used to fill empty spaces inside a package or box to prevent the contents from shifting or being damaged during transit.
comment: Un papel utilizado para rellenar y proteger objetos durante el envío o almacenamiento. Se utiliza para llenar espacios vacíos dentro de un paquete o caja para evitar que los objetos de dentro se muevan o se dañen durante el transporte. @es
label: Papel de relleno @es

Paper holders
type: Class
subclass of: Mixed use accessories
comment: A device that holds a roll of toilet paper and is typically mounted on a wall within reach of a toilet.
label: Portarrollos @es

Park benches
type: Class
subclass of: Benches
comment: A public park bench set outdoors and fixed at floor.
label: Bancos de parque @es

Parquet Floors
type: Class
subclass of: Manufacturer
label: Parquet @es

Particle boards
type: Class
subclass of: Wooden boards
comment: A building material made of small pieces of wood pressed and stuck tightly together in flat sheets.
label: Tableros aglomerados @es
alternative label: Chipboard
alternative label: Tableros de partículas @es

Patinas
type: Class
subclass of: Auxiliary substances
comment: A thin layer that variously forms on the surface of stone, copper, bronze and similar metals (tarnish produced by oxidation or other chemical processes), wooden furniture or any such acquired change of a surface through age and exposure.

Pedestals
type: Class
subclass of: Bases
comment: A solid body, cylindrical or rectangular parallelepiped in shape, that supports a column, statue, etc.
label: Pedestales @es

Pedestrian barriers
type: Class
subclass of: Industrial protection elements
label: Barreras peatonales @es

Pendant lights
type: Class
subclass of: Ceiling lighting
comment: A light fixture that is suspended from a simple rope or chain, often with a single lamp at the end.
label: Lámparas colgantes @es
alternative label: Lámparas suspendidas @es

Pendulum systems
type: Class
subclass of: Mixed use accessories
comment: A system that consists of a massless string with one end attached to a weight and the other end fixed. When an initial push is given, the pendulum will swing back and forth under the influence of gravity.
label: Sistemas de péndulo @es

Percussion instruments
type: Class
subclass of: Musical instruments
label: Instrumentos de percusión @es

Personal protective equipment
type: Class
subclass of: Auxiliary equipment
label: Equipamiento de protección personal @es

Pet doors
type: Class
subclass of: Doors
comment: An opening in a door to allow pets to enter and exit without the main door being opened.
label: Puertas para mascotas @es

Phenolic resins
type: Class
subclass of: Adhesives
label: Resinas fenólicas @es

Photo frames
type: Class
subclass of: Decoration elements
comment: A protective and decorative edging for a picture, such as a painting or photograph.
label: Marcos de fotos @es
alternative label: Picture frames

Pianos
type: Class
subclass of: Keyboard instruments
comment: A large musical instrument played by pressing the black or white keys of a keyboard, thus causing small hammers to strike metal strings to produce different notes.

Piano benches
type: Class
subclass of: Benches
comment: A bench for playing piano. Piano benches offer usually one person seating and are height adjustable.
label: Banquetas de piano @es

Piccolos
type: Class
subclass of: Flutes
comment: A small flute sounding an octave higher than the ordinary flute.
label: Flautines @es

Picnic tables
type: Class
subclass of: Outdoor tables
comment: A picnic table (or sometimes a picnic bench) is a modified table with benches expressly for the purpose of eating a meal outdoors (picnicking). In the past, picnic tables were typically made of wood, but modern tables can be made out of anything from recycled plastic to brushed metal. These tables may have table legs which are collapsible, in order to expedite transport and storage. Picnic tables have long benches as well as a table.
label: Mesas de picnic @es

Pieces of furniture
type: Class
equivalent class: Class
  intersection of: Furniture
  intersection of: Restriction
    on property: Has part
    some values from: Components
subclass of: Furniture
subclass of: Restriction
  on property: Has material
  some values from: Materials
subclass of: Restriction
  on property: Price
  some values from: Price
subclass of: Restriction
  on property: Manufactured by
  some values from: Manufacturer
subclass of: Restriction
  on property: Manufactured by
  all values from: Manufacturer
subclass of: Restriction
  on property: Colour
  some values from: string
subclass of: Restriction
  on property: Description of materials
  some values from: string
subclass of: Restriction
  on property: Certifications
  some values from: string
subclass of: Restriction
  on property: Foldable
  some values from: boolean
subclass of: Restriction
  on property: Stackable
  some values from: boolean
comment: An item of furniture.
label: Elementos de mobiliario @es

Pigeonholes
type: Class
subclass of: Cabinets
comment: Any of a set of small boxes open at the front, esp in a desk for keeping papers in or fixed on wall for messages, letters, etc.
label: Casilleros @es

Pillows
type: Class
subclass of: Bed linen
comment: A cushion used to support the head, especially in bed.
label: Almohadas @es

Pillow covers
type: Class
subclass of: Bed linen
comment: A textile that covers a pillow and is used primarily to protect the pillow from dirt, oils and sweat, as well as to make it visually appealing.
label: Fundas de almohada @es

Pillow protectors
type: Class
subclass of: Bed linen
comment: A textile designed to provide an extra layer of protection for the pillow, usually made of a waterproof or water-resistant material, such as vinyl or polyurethane, to prevent stains, allergens, and dust mites from penetrating the pillow.
label: Protectores de almohada @es

Ping-pong tables
type: Class
subclass of: Sport tables
comment: A table used for playing table tennis.
label: Mesas de ping-pong @es
alternative label: Table tennis tables

Pipes
type: Class
subclass of: Building elements
comment: A long, round, hollow object, usually made of metal or plastic, through which a liquid or gas can flow.
label: Tuberías @es

Planer
type: Class
subclass of: Manual machines
label: Cepilladora @es

Planing
type: Class
equivalent class: Restriction
  on property: Performed by
  some values from: Class
    union of: Multiple side planer
    union of: Planer
subclass of: Machining operation
label: Cepillado @es

Planters
type: Class
subclass of: Decoration elements
comment: A container for plants that afford more diversity for gardeners than pots. They are typically long, narrow, and rectangular, and are intended to house multiple plants.
label: Jardineras @es
alternative label: Gardeners
alternative label: Window boxes

Plastic materials
type: Class
subclass of: Materials
label: Materiales plásticos @es
alternative label: Synthetics

Plastic
type: Class
subclass of: Material supplier
label: Plástico @es

Plates
type: Class
subclass of: Kitchen accessories
comment: A round or oval flat dish that is used to hold food.
label: Platos @es

Plate racks
type: Class
subclass of: Racks
comment: A wooden or plastic frame in which food plates are stored or left to dry after being washed.
label: Escurreplatos @es

Platters
type: Class
subclass of: Kitchen accessories
comment: A large, flat plate used for serving food.
label: Fuentes @es
alternative label: Bandejas @es

Playground equipment
type: Class
subclass of: Outdoor equipment
comment: Equipment designed for an area designed to provide an environment for children that facilitates play.
label: Equipamiento de parques infantiles @es
alternative label: Playpark equipment

Playground fences
type: Class
subclass of: Playground equipment
comment: A safety feature designed to protect children while they play. It serves multiple purposes, such as keeping children contained within a designated area, preventing unauthorized access, and safeguarding against potential hazards in the surrounding environment.
label: Vallados de parques infantiles @es

Playground slides
type: Class
subclass of: Playground equipment
comment: A recreational structure consisting of a raised, sliding ramp at the rear, supported by a staircase that allows access to the top for sliding down the surface. It can be considered the centerpiece of the fun in modern water parks.
comment: Una construcción de carácter recreativo, que consiste en una rampa deslizante elevada en su parte posterior por una escalera que permite el ascenso a la parte superior para proceder al deslizamiento sobre la superficie. Se puede considerar como la parte central de la diversión en los parques acuáticos modernos. @es
label: Toboganes @es

Playpens
type: Class
subclass of: Children furniture
comment: An enclosure intended to retain a child whilst allowing him/her space to play for short periods.
label: Parques @es

Multijuegos
type: Class
subclass of: Playground equipment
comment: A unitary structure for children to play on, typically including a slide, and often swings, ropes to climb on, and other things found as separate structures at public playgrounds.
label: Playsets

Pliers
type: Class
subclass of: Tools
label: Alicates @es

Plumbing installation
type: Class
subclass of: Installation service
label: Instalación de fontanería @es

Plywood boards
type: Class
subclass of: Wooden boards
comment: A flat panel material which is constructed of thin veneers of wood that are bonded in layers. The direction of the grain of each layer of veneer is at right angles (90 degrees) to the next. It is very strong.
label: Tableros de contrachapado @es

Plywood
type: Class
subclass of: Material supplier
label: Madera Contrachapada @es

Polishing
type: Class
equivalent class: Restriction
  on property: Performed by
  some values from: Class
    union of: Automatic polisher
    union of: Manual polisher
subclass of: Finishing
comment: This process is usually done just after the lacquering process, increasing the brightness of the surface of the piece.
label: Pulido @es

PA (polyamide)
type: Class
subclass of: Thermoplastics
label: PA (poliamida) @es

Polyamide fabric
type: Class
subclass of: Synthetic fabric
label: Teijo de poliamida @es

Polycarbonate
type: Class
subclass of: Thermoplastics
label: Policarbonato @es

Polyester fabric
type: Class
subclass of: Synthetic fabric
label: Tejido de poliéster @es

Polyethylene
type: Class
subclass of: An envelope that protects goods during transportation.
comment: A thermoplastic polymer widely used in the manufacture of packaging and plastic products. It comes in two main forms: low-density polyethylene (LDPE) and high-density polyethylene (HDPE).
comment: Un polímero termoplástico ampliamente utilizado en la fabricación de envases y productos plásticos. Se encuentra en dos formas principales: polietileno de baja densidad (LDPE) y polietileno de alta densidad (HDPE). @es
label: Polietileno @es

Polypropylene
type: Class
subclass of: Thermoplastics
label: Polipropileno @es

Polypropylene fabric
type: Class
subclass of: Synthetic fabric
label: Tejido de polipropileno @es

Polyskin
type: Class
subclass of: Upholstery materials
label: Polipiel @es

PS (polystyrene)
type: Class
subclass of: Thermoplastics
label: PS (poliestireno) @es

Polyurethane
type: Class
subclass of: Thermoset plastics
label: Poliuretano @es

Polyurethane foam
type: Class
subclass of: Paddings
comment: A light form of rubber or plastic similar to sponge used to fill seats, cushions, etc.
label: Espuma de poliuretano @es

Polyurethane foam bags
type: Class
subclass of: Protective bags
comment: A protective bag made of polyurethane foam, which protects items from bumps, scratches and vibrations during transport or storage.
comment: Una bolsa protectora hecha de espuma de poliuretano, que protege a los objetos frente a golpes, arañazos y vibraciones durante el transporte o almacenamiento. @es
label: Bolsas de espuma de poliuretano @es

White glue
type: Class
subclass of: Adhesives
label: Cola blanca @es
alternative label: Cola de carpintero @es
alternative label: PVA (acetato de polivinilo)
alternative label: PVA (polyvinyl acetate)

PVC (polyvinyl chloride)
type: Class
subclass of: Thermoplastics
label: PVC (policloruro de vinilo) @es

PVC film
type: Class
subclass of: Laminated coating materials
label: Lámina de PVC @es
alternative label: Polyvinyl chloride film

Portable foam cutting machine
type: Class
subclass of: Manual machines
label: Cortadora portátil de espuma @es

Poufs
type: Class
subclass of: Seats
comment: A large thick cushion used as a seat or for resting the feet on.
label: Puffs @es

Pre-sewing
type: Class
equivalent class: Restriction
  on property: Performed by
  some values from: Sewing machine
subclass of: Upholstering
label: Precostura @es
alternative label: Pre-seaming

Precious metals
type: Class
subclass of: Metal materials
label: Metales preciosos @es

Pressing
type: Class
equivalent class: Restriction
  on property: Performed by
  some values from: Class
    union of: Hydraulic press with double plate
    union of: Hydraulic press with double plate, feeding belt and downloading
    union of: Hydraulic screw press for moulds
    union of: Hydraulic screw press for moulds with high frequency drying
    union of: Membrane press
    union of: Membrane press with feeding and downloading
    union of: Screw press with manual tightening
subclass of: Board preparation
label: Prensado @es

Price
type: Class
comment: The amount of money or goods for which a thing is bought or sold.
label: Precio @es

Primers
type: Class
subclass of: Coating substances
subclass of: Restriction
  on property: Solvent-based
  some values from: boolean
subclass of: Restriction
  on property: Water-based
  some values from: boolean
comment: A primer is a coat of paint that is applied directly to the bare substrate. This is the first and most important coat to be applied to the surface to be coated.
label: Imprimaciones @es

Print services
type: Class
subclass of: Services
label: Servicios de impresión @es

Print Services
type: Class
subclass of: Service provider
label: Servicios de Impresión @es

Processes
type: Class
subclass of: Restriction
  on property: Certifications
  some values from: string
comment: This category contains processes related to the manufacturing of furniture items.
label: Procesos @es

Products
type: Class
subclass of: Restriction
  on property: Has material
  some values from: Materials
subclass of: Restriction
  on property: Price
  some values from: Price
subclass of: Restriction
  on property: Colour
  some values from: string
subclass of: Restriction
  on property: Description
  some values from: string
subclass of: Restriction
  on property: Description of materials
  some values from: string
subclass of: Restriction
  on property: Name
  some values from: string
subclass of: Restriction
  on property: Technical specifications
  some values from: string
subclass of: Restriction
  on property: Certifications
  some values from: string
comment: Something tangible or intangible produced by a natural process, manufacture, or an intellectual process.
label: Productos @es

Product design
type: Class
subclass of: Services
label: Diseño de producto @es

Professional chairs
type: Class
subclass of: Chairs
comment: A chair that is designed to be used by certain professionals.
label: Silla profesionales @es

Profiles
type: Class
subclass of: Fittings
comment: A long material with a constant cross-sectional geometry. Profiles are standard semi-finished products in the processing industry. They are mainly used for static tasks. Metal profiles have proved to be particularly suitable due to their simple production and processing, good reusability and high bending strength.
label: Perfiles @es
alternative label: Metal profiles
alternative label: Perfiles metálicos @es

Protective bags
type: Class
subclass of: Cushion packaging
comment: A lightweight, flexible, and soft container that protects objects from dust and moisture.
comment: Un envase liviano, flexible y suave que protege a los objetos frente el polvo y la humedad. @es
label: Bolsas de protección @es

Protective goggles
type: Class
subclass of: Personal protective equipment
label: Gafas de protección @es

Protective plates
type: Class
subclass of: Cushion packaging
comment: A sheet used for packaging, which absorbs impacts and prevents damage during transport.
comment: Una plancha utilizada para embalaje, que amortigua golpes y evitan daños en el transporte. @es
label: Planchas de protección @es
alternative label: Láminas de protección @es
alternative label: Protective sheets

Pull-down beds
type: Class
subclass of: Beds
comment: A bed designed to be folded or swung into a cabinet when not in use.
label: Camas abatibles @es
alternative label: Fold-away beds
alternative label: Murphy beds

Pulpits
type: Class
subclass of: Religious tables
label: Púlpitos @es

Pumps
type: Class
subclass of: Auxiliary equipment
label: Bombas @es

Quality control
type: Class
subclass of: Services
label: Control de calidad @es

Quality Control / Tests
type: Class
subclass of: Service provider
label: Control de Calidad / Ensayos @es

Quartering
type: Class
subclass of: Processes
label: Despiece @es

Quilts
type: Class
subclass of: Bed linen
comment: An outer bed covering, which serves as both decoration and warmth.
label: Colchas @es
alternative label: Cubrecamas @es
alternative label: Sobrecamas @es

Racks
type: Class
subclass of: Storage pieces of furniture
comment: A framework, stand, or grating on or in which articles are placed.
label: Exhibidores @es

Rack end barriers
type: Class
subclass of: Industrial protection elements
label: Barreras de estanterías @es

Rack leg protectors
type: Class
subclass of: Industrial protection elements
label: Protectores de puntal de estante @es

Radiators
type: Class
subclass of: Household appliances
comment: A hollow metal device for heating rooms. Radiators are usually connected by pipes through which hot water is sent.
label: Radiadores @es

Radiator covers
type: Class
subclass of: Mixed use accessories
comment: An enclosure designed to conceal radiators, often enhancing their appearance while providing additional functionality.
label: Cubiertas para radiadores @es
alternative label: Cubreradiadores @es

Radios
type: Class
subclass of: Household appliances
comment: An electronic device designed to receive, demodulate, and amplify radio signals from sound broadcasting stations, etc.

Rail transport
type: Class
subclass of: Transport
comment: A service for of taking goods or people from one place to another by rail.
label: Transporte ferroviario @es

Range hoods
type: Class
subclass of: Kitchen accessories
comment: A ventilation appliance expelling or recycling air that contains cooking fumes and odors.
comment: Aparato electrodoméstico que tiene un ventilador (extractor) inserto en la carcasa; se coloca encima de la cocina, y se utiliza para atrapar la grasa en suspensión en el aire, los productos de combustión, el humo, los olores, el calor, y el vapor del aire mediante una combinación de filtrado y la evacuación del aire. @es
label: Campanas extractoras @es
alternative label: Fume hoods

Rasps
type: Class
subclass of: Tools
label: Escofinas @es

Reception tables
type: Class
subclass of: Office tables
comment: An individual piece of furniture, which is not similar to any other type of office furniture. The typical height for reception tables is 30"-34" and they come with counter tops that help maintain the secrecy of the paperwork that passes through this area, and helps maintain the privacy of the receptionist(s).
label: Mesas de recepción @es
alternative label: Reception desks

Recliners
type: Class
subclass of: Domestic chairs
comment: An armchair whose back can be lowered and foot can be raised to allow the sitter to recline in it.
label: Sillas reclinables @es
alternative label: Reclining chairs

Recorders
type: Class
subclass of: Flutes
comment: A wind instrument of the flute family, blown through a fipple in the mouth end, having a reedlike quality of tone.
label: Flautas dulces @es

Recycling bins
type: Class
subclass of: Waste containers
comment: A container specifically designated for collecting recyclable materials, including paper, plastics, metals, and glass, separate from non-recyclable waste to enable their sorting, processing, and incorporation into new products.
label: Contenedores de reciclaje @es
alternative label: Curbside recycling bins

Refrigerators
type: Class
subclass of: Household appliances
comment: An insulated cupboard, designed to keep food etc cold, operated by electricity.
comment: Un armario aislado, diseñado para mantener fríos los alimentos, etc., que funciona con electricidad. @es
label: Frigoríficos @es
alternative label: Congeladores @es
alternative label: Freezers
alternative label: Fridges
alternative label: Neveras @es

Religious benches
type: Class
subclass of: Benches
comment: A bench used in religious ceremonies.
label: Bancos para ceremonias religiosas @es

Religious tables
type: Class
subclass of: Tables
comment: A table used in religious ceremonies.
label: Mesas para ceremonias religiosas @es

Resawing machine
type: Class
subclass of: Semi-automatic machines
label: Sierra desdobladora @es

Restaurant and bar chairs
type: Class
subclass of: Chairs
comment: A chair used by customers of restaurants and bars.
comment: Mesa usada por los clientes de bares y restaurantes. @es
label: Sillas de bar y restaurante @es

Restaurant and bar tables
type: Class
subclass of: Tables
comment: A table used by customers of restaurants and bars.
comment: Mesa utilizado por los clientes de bares y restaurantes. @es
label: Mesas de bar y restaurante @es

Furniture for Retail
type: Class
subclass of: Manufacturer
label: Muebles para Establecimientos Comerciales @es

Retailer
type: Class
subclass of: Organization
comment: A person who sells goods to the general public.
label: Distribuidor @es
alternative label: Shop
alternative label: Tienda @es

Retention packaging
type: Class
subclass of: Tertiary packaging
comment: A packing element used to secure an object within a rigid frame or box, preventing it from moving.
comment: Un elemento de embalaje que se utiliza para asegurar un objeto dentro de un marco rígido o caja, evitando que se mueva. @es
label: Embalaje de retención @es

Reverse logistics
type: Class
subclass of: Logistics services
comment: A service consisting of moving goods from their typical final destination for the purpose of capturing value, or proper disposal.
label: Logística inversa @es

Revolving doors
type: Class
subclass of: Doors
comment: A type of door that typically consists of a structure with three or four panels that meet in the center and rotate one way about a vertical axis (sometimes the movement is not in a circle, but following a more complicated path, a combination of rotation and translation). Between the point of access and the point of exit the user walks between two moving panels. The door may be motorized or the user needs to push the front panel, and the space between two panels may be designed for multiple users or a single one. This door design is used primarily to maintain an air seal from the outside, thus minimizing leaking of climate controlled air from the building and the resulting expense of compensating for the loss.
label: Puertas giratorias @es

Ribbon
type: Class
subclass of: Mixed use textiles
comment: A narrow piece of material, used to tie things or for decoration.
label: Cinta @es

Road transport
type: Class
subclass of: Transport
comment: A service for of taking goods or people from one place to another by land.
label: Transporte por carretera @es
alternative label: Land transport
alternative label: Transporte terrestre @es

Robots
type: Class
subclass of: Machines

Rocking chairs
type: Class
subclass of: Domestic chairs
comment: A chair mounted on rockers so that it can be rocked backwards and forwards by the person sitting on it.
label: Mecedoras @es
alternative label: Rockers

Roller machine
type: Class
subclass of: Automatic machines
label: Máquina de rodillo @es

Roman blinds
type: Class
subclass of: Mixed use accessories
comment: A type of window covering that uses horizontal rods sewn into the fabric to give it a firm, structured look.
label: Estores @es

Roof cladding
type: Class
subclass of: Floorings and coatings
comment: A protective layer applied to the exterior surface of a roof to provide an additional barrier against rain, wind, sun, and snow. This coating can also improve its durability and lifespan.
label: Revestimiento de techos @es

Roof ladders
type: Class
subclass of: Ladders
comment: A rigid ladder with large hook at the top to grip the ridge of a pitched roof.
label: Escaleras de tejado @es

Roof racks
type: Class
subclass of: Racks
comment: A system used on automobiles which was designed to carry sporting goods and luggage on top of a car. They're popular among skiers, snowboarders, cyclist, and kayakers. In Spanish, "vaca".
label: Bacas @es

Rosewood
type: Class
subclass of: Wood
comment: Tree which wood can vary from yellow to red. Its fiber is right and can be entwined. It has medium grain.
label: Madera de palisandro @es
label: Palo de rosa @es
alternative label: Palisander

Rubber
type: Class
subclass of: Elastomer plastics
label: Caucho @es

Safety equipment
type: Class
subclass of: Auxiliary equipment
label: Equipamiento de seguridad @es

Safety footwear
type: Class
subclass of: Personal protective equipment
label: Calzado de seguridad @es

Safety grip handles
type: Class
subclass of: Handles
comment: A type of handle that serves as a support bar, providing stability and helping to maintain balance thanks to its placement at strategic points in the bathroom.
label: Agarres de seguridad @es
alternative label: Asideros @es

Safety helmets
type: Class
subclass of: Personal protective equipment
label: Cascos de seguridad @es

Safety showers
type: Class
subclass of: Safety equipment
label: Duchas de seguridad @es

Sales Agent
type: Class
subclass of: Service provider
label: Agente Comercial @es

Sand paper
type: Class
subclass of: Auxiliary materials
label: Papel de lija @es

Sanding machine for edges
type: Class
subclass of: Semi-automatic machines
label: Lijadora de cantos @es

Sawing
type: Class
equivalent class: Restriction
  on property: Performed by
  some values from: Class
    union of: Band sawing machine
    union of: CNC band saw
    union of: Edge bander
    union of: Milling machine
    union of: Resawing machine
subclass of: First processing
label: Aserrado @es

Sawn timber
type: Class
subclass of: Building timber
label: Madera aserrada @es

Saxophones
type: Class
subclass of: Woodwind instruments
comment: A keyed wind instrument of mellow tone colour, used mainly in jazz and dance music. It is made in various sizes, has a conical bore, and a single reed. It belongs to the woodwind family because it has a simple reed mouthpiece, which is attached to the mouthpiece by means of a ligature, very similar to the clarinet mouthpiece.
label: Saxofones @es

Scaffolds
type: Class
subclass of: Furniture accessories
comment: A temporary raised platform on which workers stand to paint, repair, or build high parts of a building.
label: Andamios @es
alternative label: Andamiaje @es

School chairs
type: Class
subclass of: Chairs
comment: A type of chair created and designed for use in a classroom, college, school, university or education environment.
label: Sillas escolares @es
alternative label: Sillas de pala @es

School desks
type: Class
subclass of: Tables
comment: A desk to be used in educational institutions.
label: Pupitres @es

Screws
type: Class
subclass of: Basic assembly hardware
subclass of: Restriction
  on property: Drive type
  some values from: string
subclass of: Restriction
  on property: Head type
  some values from: string
comment: A type of fastener, sometimes similar to a bolt, typically made of metal, and characterized by a helical ridge, known as a male thread (external thread) or just thread. The term "bolt" is sometimes used to refer to screws. although they have small differences.
label: Tornillos @es

Screw caps
type: Class
subclass of: Mixed use accessories
comment: A lid that is twisted on to a bottle or jar.
label: Tapones de rosca @es

Screw cover caps
type: Class
subclass of: Mixed use accessories
comment: A cap that protects the heads of exposed bolts, nuts, and screws from damage and entry, and provides a finished look.
label: Tapatornillos @es

Screw press with manual tightening
type: Class
subclass of: Manual machines
label: Prensa de husillos con apriete manual @es

Screwdrivers
type: Class
subclass of: Tools
label: Destornilladores @es

Seal
type: Class
subclass of: Retention packaging
comment: A piece of sticky paper or wax that is fixed to a container or door and must be broken before the container or door can be opened.
comment: Un trozo de papel adhesivo o cera que está fijado a un recipiente o puerta y que debe romperse antes de que éste pueda abrirse. @es
label: Precinto @es

Sealers
type: Class
subclass of: Coating substances
subclass of: Restriction
  on property: Solvent-based
  some values from: boolean
subclass of: Restriction
  on property: Water-based
  some values from: boolean
comment: A sealer is a product that is applied to the wood in order to protect it from damage. This coats the wood in order to provide a layer of protection. Sealers effectively block the pores of the wood from becoming altered due to moisture or chemical reactions.
label: Fondos @es

Sealing
type: Class
equivalent class: Restriction
  on property: Performed by
  some values from: Sealing machine
subclass of: Finishing
label: Sellado @es

Sealing machine
type: Class
subclass of: Automatic machines
comment: Rolling machine that applies a sealing plaster.
label: Selladora @es

Seats
type: Class
subclass of: Pieces of furniture
subclass of: Restriction
  on property: Seat part
  some values from: Seat parts
subclass of: Restriction
  on property: Seat part
  all values from: Seat parts
comment: A thing made or used for sitting on.
label: Asientos @es

Seat shells
type: Class
subclass of: Components
comment: An adjustable cover for the seat that protects the original upholstery from wear and tear, spills, and other potential damage.
label: Carcasas de asiento @es

Mechanisms for seats
type: Class
subclass of: Components
comment: A mechanism to regulate the parameters of a seat, such as the height of the seat part and the backrest.
label: Mecanismos para asientos @es

Seat parts
type: Class
subclass of: Components
comment: The particular part of a piece of furniture on which one rests in sitting.
label: Piezas asiento @es

Security Elements
type: Class
subclass of: Material supplier
label: Elementos de Seguridad @es

Seesaws
type: Class
subclass of: Playground equipment
comment: A plank balanced in the middle so that two people seated on the ends can ride up and down by pushing on the ground with their feet.
label: Balancines @es

Semi-automatic lathe
type: Class
subclass of: Semi-automatic machines
label: Torno semi automático @es

Semi-automatic press for drawers assembly
type: Class
subclass of: Semi-automatic machines
label: Prensa semi automática para montaje de cajones @es

Semi-automatic machines
type: Class
subclass of: Machines
label: Máquinas semi automáticas @es

Separators
type: Class
subclass of: Mixed use accessories
comment: A device that is used to separate elements.
label: Separadores @es

Services
type: Class
subclass of: Restriction
  on property: Description
  some values from: string
subclass of: Restriction
  on property: Name
  some values from: string
subclass of: Restriction
  on property: Certifications
  some values from: string
comment: A system that provides something that the public needs, organized by the government or a private company.
label: Servicios @es

Service provider
type: Class
subclass of: Supplier
label: Proveedor de servicios @es

Serviettes
type: Class
subclass of: Table linen
comment: A square of cloth or paper that is used to protect the clothes or to wipe the mouth when eating.
label: Servilletas @es
alternative label: Napkins

Serving trolleys
type: Class
subclass of: Domestic tables
comment: A mobile table, usually provided with handles and wheels, with removalbe or fixed tray(s). In Spanish, also called "camarera".
label: Carritos de servicio @es
alternative label: Camareras @es

Sewing
type: Class
equivalent class: Restriction
  on property: Performed by
  some values from: Sewing machine
subclass of: Upholstering
label: Costura @es
alternative label: Seaming

Sewing machine
type: Class
subclass of: Semi-automatic machines
label: Máquina de coser @es

Sewing tables
type: Class
subclass of: Work tables
comment: A worktable for holding sewing materials, often supplied with a bag or pouch for needlework.
label: Mesas de costura @es
alternative label: Mesas de coser @es

Sheet jpiner with glue and hot press
type: Class
subclass of: Semi-automatic machines
label: Juntadora de chapa con cola y prensa caliente @es

Sheet joiner with paper or thread
type: Class
subclass of: Manual machines
label: Juntadora de chapa con papel ó hilo @es

Sheet to board joining
type: Class
equivalent class: Restriction
  on property: Performed by
  some values from: Class
    union of: Gluing machine
    union of: Gluing machine with feeder
subclass of: Board preparation
label: Encolado chapa tablero @es

Sheets joining
type: Class
equivalent class: Restriction
  on property: Performed by
  some values from: Class
    union of: Sheet jpiner with glue and hot press
    union of: Sheet joiner with paper or thread
subclass of: Board preparation
label: Unión de chapas @es

Shelves
type: Class
subclass of: Storage pieces of furniture
comment: One or a set of flat, usually rectangular structures composed of a rigid material, such as wood, glass, or metal, fixed at right angles to a wall or other vertical surface and used to hold or store objects.
label: Estanterías @es

Shoe racks
type: Class
subclass of: Racks
comment: A rack for storing shoes.
label: Zapateros @es
alternative label: Shoe cabinets

Showers
type: Class
subclass of: Bathroom accessories
comment: Area of space enclosed by glass/formed/tiled walls, with drainage, in which one washes/baths under a stream of water.
label: Duchas @es

Shower cabins
type: Class
subclass of: Bathroom accessories
comment: A system used in the bathroom that prevents water from spreading, protecting the space and making the shower experience more comfortable and functional.
label: Cabinas de ducha @es
alternative label: Shower stalls

Shower curtains
type: Class
subclass of: Bath textile
comment: A plastic curtain which covers the entrance to a shower.
label: Cortinas de ducha @es
alternative label: Bath curtains
alternative label: Cortinas de baño @es

Shower enclosures
type: Class
subclass of: Bathroom accessories
comment: A component that surrounds the shower area and is typically made of glass or acrylic. It keeps the water within the designated space, ensuring that the rest of the bathroom remains dry.
label: Mamparas de baño @es
alternative label: Shower screens

Shower trays
type: Class
subclass of: Bathroom accessories
comment: The tray at the base of a shower on which a person stands and onto which the water splashes, typically with an exit hole allowing water to drain away.
label: Platos de ducha @es

Shrink film
type: Class
subclass of: Retention packaging
comment: A wrapping film that, when exposed to heat, contracts and conforms firmly to the shape of the object, providing an airtight and air-free seal.
comment: Un film para envolver que, cuando se expone al calor, se contrae y se ajusta con firmeza a la forma del objeto, proporcionando un sellado hermético y libre de aire. @es
label: Film retráctil @es

Sideboards
type: Class
subclass of: Cabinets
comment: A piece of furniture traditionally used in the dining room for serving food, for displaying serving dishes such as silver, and for storage. It usually consists of a set of cabinets, or cupboards, and one or more drawers, all topped by a flat display surface for conveniently holding food, serving dishes, and even lighting devices. The overall height of the tops of most sideboards is approximately waist level.
label: Aparadores @es

Sieves
type: Class
subclass of: Tools
label: Tamices @es

Signs
type: Class
subclass of: Furniture accessories
comment: A mark or shape with a particular meaning.
label: Señales @es

Sign caps
type: Class
subclass of: Industrial protection elements
label: Acoples para señalización @es

Silver foil
type: Class
subclass of: Laminated coating materials
label: Papel de plata @es

Simple drill
type: Class
subclass of: Manual machines
label: Taladradora simple @es

Single bedroom
type: Class
subclass of: Furniture compositions
comment: A combination of furniture items to furnish a room used by a single person for sleeping in.
label: Dormitorio individual @es

Single blade mitre saw
type: Class
subclass of: Manual machines
label: Tronzadora de un cabezal @es

Single head sander for mouldings
type: Class
subclass of: Manual machines
label: Lijadora de un cabezal para molduras @es

Single head tenoning
type: Class
subclass of: Semi-automatic machines
label: Espigadora de un cabezal @es

Single roll forming machine
type: Class
subclass of: Semi-automatic machines
label: Perfiladora simple @es

Single side sanding
type: Class
equivalent class: Restriction
  on property: Performed by
  some values from: Class
    union of: Disc sander
    union of: Horizontal inferior band sander
    union of: Horizontal superior band sander
    union of: Vertical band sander
subclass of: Surface preparation
label: Lijado una cara @es

Sinks
type: Class
subclass of: Mixed use accessories
comment: A fixed open container, specially in a kitchen, with a water supply and a drain for waste water to flow away, used for washing dishes, cleaning vegetables, etc.
comment: Un recipiente fijo abierto, especialmente en una cocina, con un suministro de agua y un desagüe para que fluyan las aguas residuales, utilizado para lavar platos, limpiar verduras, etc. @es
label: Fregaderos @es
alternative label: Pilas @es

Sisal fibre
type: Class
subclass of: Natural fibre
label: Fibra de sisal @es

Slider plates
type: Class
subclass of: Industrial protection elements
label: Bases removibles @es

Sliding doors
type: Class
subclass of: Doors
comment: A door usually made of glass, that slides open and sometimes has a screen. Sliding doors are common in many houses, particularly as an entrance to the backyard. Such doors are also popular for use for the entrances to commercial structures.
label: Puertas correderas @es

Sliding panels
type: Class
subclass of: Mixed use accessories
comment: A type of curtain made from different fabrics that slide along a track with tracks along which the panels move independently. This allows for varying degrees of light and/or privacy.
label: Paneles japoneses @es

Sliding rails
type: Class
subclass of: Fittings
comment: A hardware device mainly designed to achieve linear reciprocating motion of the bearing part's inner rail (or slider).
label: Guías correderas @es

Sliding table saw with manual thrust
type: Class
subclass of: Manual machines
label: Escuadradora con empuje manual @es

Sliding windows
type: Class
subclass of: Windows
comment: A window that opens by sliding horizontally along a top and bottom track in the window frame.
label: Ventanas correderas @es

Slippers
type: Class
subclass of: Bath textile
comment: A light shoe of some soft material, for wearing around the house.
label: Zapatillas de ducha @es

Snare drums
type: Class
subclass of: Percussion instruments
comment: A small drum with metal strings across one side that make a continuous sound when the drum is hit.
label: Cajas de percusión @es

Soap dishes
type: Class
subclass of: Mixed use accessories
comment: A shallow, open container or platform where a bar of soap may be placed to dry after use.
label: Jaboneras @es

Soap dispensers
type: Class
subclass of: Mixed use accessories
comment: A device that, when manipulated or triggered appropriately, dispenses soap.
label: Dosificadores de jabón @es

Sockets
type: Class
subclass of: Bases
comment: A part with an opening or hollow into which some other part (e.g., pipe, probe) can be fitted.
label: Zócalos @es

Sofas
type: Class
subclass of: Seats
comment: Comfortable seat with raised arms and back, filled or covered with soft material and long enough for two or more people to sit on.
label: Sofás @es
alternative label: Couches

Sofa beds
type: Class
subclass of: Sofas
comment: A sofa that can be converted into a bed.
label: Sofás cama @es
alternative label: Bed couches
alternative label: Bed settees

Sofa covers
type: Class
subclass of: Mixed use textiles
comment: A cover used to wrap a sofa to protect it from damage. They are usually made from a blend of polyester and cotton, providing durability and a soft feel.
label: Fundas de sofá @es

Sofa tables
type: Class
subclass of: Domestic tables
comment: A specifically designed table for placement directly in front of sofas for serving tea, writing, dining, or other convenient uses.
label: Mesas de sofá @es

Software
type: Class
subclass of: Services

Software
type: Class
subclass of: Service provider

Solid wooden boards
type: Class
subclass of: Wooden boards
label: Tableros de madera maciza @es

Solvents
type: Class
subclass of: Auxiliary substances
comment: A solvent is a substance that dissolves a liquid, solid or gas, resulting in a solution. This is usually a liquid but can also be a solid, a gas, or a supercritical fluid. The quantity of solute that can dissolve in a specific volume of solvent varies with temperature. Common uses for organic solvents are in dry cleaning, as paint thinners, as nail polish removers and glue solvents, in spot removers, in detergents and in perfumes.
label: Disolventes @es

Sound systems
type: Class
subclass of: Household appliances
comment: A set of equipment for playing recorded music, or for making a band's music able to be heard by everyone at a concert.
label: Equipos de sonido @es
alternative label: Equipos de música @es
alternative label: Stereos

Spanish chests
type: Class
subclass of: Chests of drawers
comment: A vertical piece of furniture with lots of compartments and small drawers, normally decorated imitating classical architecture. Made to be placed on a table.
label: Bargueños @es

Spice racks
type: Class
subclass of: Racks
comment: A frame with small drawers or shelves to store spices.
label: Especieros @es
alternative label: Spice cupboards

Spindle moulder
type: Class
subclass of: Semi-automatic machines
label: Tupí @es

Spinets
type: Class
subclass of: Keyboard instruments
comment: A keyboard instrument in which the strings are plucked by means of plectra.
label: Espinetas @es

Sport tables
type: Class
subclass of: Tables
comment: A table that is used to play certain sports.
label: Mesas para deportes @es

Spray application gun
type: Class
subclass of: Manual machines
label: Pistola de aplicación @es

Spraying application
type: Class
subclass of: Techniques
label: Pulverización @es

Spring mattresses
type: Class
subclass of: Mattresses
comment: A mattress containing springs in a frame.
label: Colchones de muelles @es

Spring riders
type: Class
subclass of: Playground equipment
comment: A playground item for children consisting of a large spring beneath a central beam or flange on which the rider sits and rocks.
label: Figuras de muelle @es
alternative label: Spring rockers

Sprouting
type: Class
equivalent class: Restriction
  on property: Performed by
  some values from: Class
    union of: Double head tenoning
    union of: Double head tenoning with supply
    union of: Numerical control double head tenoning
    union of: Numerical control double head tenoning with supply
    union of: Single head tenoning
subclass of: Machining operation
label: Espigado @es

Spyholes
type: Class
subclass of: Components
comment: An opening made in the wall or door of the house that faces the outside to see who is calling.
label: Mirillas @es

Square bars
type: Class
subclass of: Building timber
label: Cuadradillos @es

Stable doors
type: Class
subclass of: Doors
comment: Also known as dutch door, a stable door is divided in half horizontally. The top half can be opened to allow the horse to be fed, while the bottom half can be closed to keep the animal inside.
label: Puertas de establo @es

Stacker robot
type: Class
subclass of: Robots
label: Robot apiladora @es

Stacking
type: Class
equivalent class: Restriction
  on property: Performed by
  some values from: Class
    union of: Electric stacker
    union of: Stacker robot
subclass of: Storage
label: Apilado @es

Stainless steel
type: Class
subclass of: Steel
label: Acero inoxidable @es

Standards
type: Class
comment: A technical/legal document which contain technical specifications eligible to be adopted and developed by consensus of the interested parts, such as manufacturers, users, administration, association and other parties. It comes from the experience and the technical development and it is approved by standardisation bodies at regional, national or international level.
label: Estándares @es

Staples
type: Class
subclass of: Retention packaging
comment: A piece of metal, whose two ends, bent and sharpened, are nailed together to join or hold two objects.
comment: Una pieza de metal, cuyos dos extremos, doblados y aguzados, se clavan para unir o sujetar dos objetos. @es
label: Grapas @es

Stapler robot
type: Class
subclass of: Robots
label: Robot grapadora @es

Stapling
type: Class
equivalent class: Restriction
  on property: Performed by
  some values from: Class
    union of: Air stapler
    union of: Electric stapler
    union of: Stapler robot
subclass of: Assembly
label: Grapado @es

Stays
type: Class
subclass of: Fittings
comment: A device used to contain or guide a body in its fall.
label: Retenidas @es

Steel
type: Class
subclass of: Metal materials
label: Acero @es

Steps
type: Class
subclass of: Components
comment: Each of the parts of a flight of stairs that serve to go up or down it.
label: Peldaños @es

Stepladders
type: Class
subclass of: Ladders
comment: A ladder that has broad flat steps and two pairs of legs connected by a hinge at the top and that opens at the bottom to become freestanding.
label: Escaleras de mano @es

Sticking
type: Class
subclass of: Assembly
label: Unión @es

Stone
type: Class
subclass of: Mineral materials
label: Piedra @es

Stools
type: Class
equivalent class: Class
  intersection of: Seats
  intersection of: Restriction
    on property: Seat part
    qualified cardinality: 1
    on class: Seat parts
subclass of: Seats
comment: A seat without a back or arms.
label: Taburetes @es

Storage
type: Class
subclass of: Processes
label: Almacenamiento @es

Storage pieces of furniture
type: Class
subclass of: Pieces of furniture
comment: A piece of furniture intended to store items such as clothes, foods, etc.
label: Muebles de almacenamiento @es

Strainers
type: Class
subclass of: Kitchen accessories
comment: An utensil with a lot of small holes in it, used for separating solids from liquids.
label: Coladores @es

Straps
type: Class
subclass of: Mixed use textiles
comment: A narrow piece of leather, cloth or other material that is used to fasten something, keep something in place, carry something or hold onto something.
label: Cinchas @es

Strapping bands
type: Class
subclass of: Retention packaging
comment: A band used to fasten load units onto carriers for safe transport.
comment: Una banda utilizada para sujetar las unidades de carga a los transportadores para un transporte seguro. @es
label: Flejes @es

Straw mattresses
type: Class
subclass of: Mattresses
comment: A mattress that is stuffed with straw.
label: Colchones de paja @es
alternative label: Jergones @es
alternative label: Palliasses

Straw
type: Class
subclass of: Material supplier
label: Mimbre @es

Street benches
type: Class
subclass of: Benches
comment: A public street bench set outdoors and fixed at floor.
label: Bancos de calle @es

Stretch film
type: Class
subclass of: An envelope that protects goods during transportation.
comment: A wrapping film that adapts to different shapes of objects and provides a reliable hold, commonly used for packing pallets.
comment: Un film para envolver que se adapta a diferentes formas de objetos y proporciona una sujeción confiable, habitualmente utilizado para embalar pallets. @es
label: Film extensible @es
alternative label: Film estirable @es
alternative label: Film paletizable @es

Stretchers
type: Class
subclass of: Beds
comment: A light weight bed used for transportating patients.
label: Camillas @es

Stringed instruments
type: Class
subclass of: Musical instruments
comment: A musical instrument that produces sounds through the vibrations of one or more strings, usually amplified by means of a sound box.
label: Instrumentos de cuerda @es

Stripping
type: Class
equivalent class: Restriction
  on property: Performed by
  some values from: Derinding machine
subclass of: First processing
label: Descortezado @es

Structures
type: Class
subclass of: Components
comment: A set of interconnecting parts of any complex thing.
label: Estructuras @es

Outsourcing
type: Class
subclass of: Service provider

Supplier
type: Class
subclass of: Organization
label: Proveedor @es

Surface preparation
type: Class
subclass of: Processes
label: Preparación de superficies @es

Swings
type: Class
subclass of: Playground equipment
comment: A hanging seat, usually found in a playground for children, a circus for acrobats, or on a porch for relaxing. The seat of a swing can be attached to a chain or a rope. Once a swing is in motion it continues to oscillate like a pendulum until drag (or interference) brings it to a halt.
comment: Un asiento colgante, que suele encontrarse en parques infantiles, circos para acróbatas o porches para relajarse. El asiento puede estar sujeto a una cadena o una cuerda. Una vez en movimiento, el columpio oscila como un péndulo hasta que la resistencia (o interferencia) lo detiene. @es
label: Columpios @es

Swing doors
type: Class
subclass of: Doors
comment: A door that has special hinges that allow it to open either outwards or inwards, and is usually sprung to keep it closed. Swing doors are often used in saloons and public bars.
label: Puertas batientes @es

Swing windows
type: Class
subclass of: Windows
comment: A type of window hung on a hinge on each of two opposite sides that allows the window to rotate when opened. The hinges can be mounted at the top and bottom (vertically) or on each jamb (horizontally).
label: Ventanas batientes @es

Swivels
type: Class
subclass of: Bases
comment: A coupling device that allows free turning of the parts attached to it.
comment: Un dispositivo de acoplamiento que permite el giro libre de las piezas unidas al mismo. @es
label: Pivotes @es
alternative label: Base giratoria @es
alternative label: Swivel base

Synthetic fabric
type: Class
subclass of: Upholstery materials
label: Tejido sintético @es

Tables
type: Class
subclass of: Pieces of furniture
comment: A form of furniture composed of a horizontal surface supported by a base, usually four legs. It is often used to hold objects or food at a convenient or comfortable height when sitting. Generic tables are typically meant for combined use with chairs.
label: Mesas @es

Table lamps
type: Class
subclass of: Lighting
comment: A small electric lamp which stands on a table or other piece of furniture.
label: Lámparas de mesa @es

Table linen
type: Class
subclass of: Home textiles
comment: A textile product used in a table.
label: Ropa de mesa @es

Table mats
type: Class
subclass of: Table linen
comment: A cover of rubber, cloth or other fabric, that is usually placed on tables and other furniture for decoration or protection.
label: Tapetes de mesa @es

Table press
type: Class
subclass of: Semi-automatic machines
label: Prensa de mesa @es

Table skirts
type: Class
subclass of: Table linen
comment: A cloth or paper covering for the table edges used to hide unsightly table legs or make the table seem more decorative.
comment: Las faldas de mesa son manteles de tela o papel usados para ocultar las patas de la mesa o hacerla más estética. @es
label: Faldas de mesa @es

Table tops
type: Class
subclass of: Mixed use accessories
subclass of: Restriction
  on property: Vertical surface
  some values from: Vertical surfaces
subclass of: Restriction
  on property: Vertical surface
  all values from: Vertical surfaces
subclass of: Restriction
  on property: Vertical surface
  qualified cardinality: 1
  on class: Vertical surfaces
comment: A board bearing a notice or on which notices may be posted (as at a school).
label: Tableros de mesa @es

Tableclothes
type: Class
subclass of: Table linen
comment: A cloth that is used for covering the top of a table, especially during meals.
label: Manteles @es

Tambourines
type: Class
subclass of: Percussion instruments
comment: A musical instrument that has a round wooden frame, sometimes covered with plastic or skin, with metal discs around the edge. It is played by shaking it or hitting it with the hand.
label: Panderetas @es

Taps
type: Class
subclass of: Mixed use accessories
comment: A device that controls the flow of a liquid or gas from a pipe or container, for example on a sink.
label: Grifos @es
alternative label: Faucets
alternative label: Water taps

Tassels
type: Class
subclass of: Mixed use textiles
comment: A bunch of threads that are tied together at one end and hang from cushions, curtains, clothes, etc. as a decoration.
label: Flecos @es

Techniques
type: Class
comment: A particular method of doing an activity, usually a method that involves practical skills.
label: Técnicas @es

Telephone tables
type: Class
subclass of: Domestic tables
comment: A small auxiliary table to put the telephone on it.
label: Mesas de teléfono @es

Telescopic ladders
type: Class
subclass of: Ladders
comment: A type of ladder than can be extended and collapsed in a similar way to a telescope, enabling to fully collapse into themselves so they can be easily stored in smaller spaces.
label: Escaleras telescópicas @es

TV
type: Class
subclass of: Household appliances
comment: A device used as a source of entertainment, which picks up electronically transmitted images.
alternative label: Televisiones @es
alternative label: Televisions
alternative label: Televisores @es

TV stands
type: Class
subclass of: Domestic tables
comment: A trolley for supporting the T.V.
label: Mesas de TV @es
alternative label: T.V. trolleys

Templating
type: Class
equivalent class: Restriction
  on property: Performed by
  some values from: Class
    union of: Double spindle moulder
    union of: Double spindler moulder with return
    union of: Milling machine
subclass of: Machining operation
label: Replantillado @es

Terrace and garden
type: Class
subclass of: Furniture compositions
comment: A combination of furniture items to furnish a flat area of stone or grass next to a building where people can sit, or a piece of land next to a house, with flowers, vegetables, other plants, and often grass.
label: Terraza y jardín @es

Tertiary packaging
type: Class
subclass of: Products
comment: A type of packaging used to protect manufactured goods for shipping or storing. It is used to protect not only the product but also its secondary and primary packaging.
comment: Un tipo de embalaje utilizado para proteger los productos manufacturados durante su envío o almacenamiento. Se utiliza para proteger no solo el producto, sino también su embalaje primario y secundario. @es
label: Embalaje terciario @es

Test tubes
type: Class
subclass of: Tools
label: Tubos de ensayo @es

Textile coating
type: Class
subclass of: Upholstering
comment: This is usually a manual process in which the operator places the fabric using staples.
label: Recubrimiento textil @es

Textile
type: Class
subclass of: Material supplier
label: Textil @es

Thermometers
type: Class
subclass of: Measuring instruments
label: Termómetros @es

Thermoplastics
type: Class
subclass of: Plastic materials
label: Termoplásticos @es

Thermoset plastics
type: Class
subclass of: Plastic materials
label: Plásticos termoestables @es

Thickening
type: Class
equivalent class: Restriction
  on property: Performed by
  some values from: Thicknesser
subclass of: Machining operation
label: Regruesado @es

Thicknesser
type: Class
subclass of: Manual machines
label: Regruesadora @es

Three-dimensional machining
type: Class
equivalent class: Restriction
  on property: Performed by
  some values from: CNC machining centre
subclass of: Machining operation
label: Mecanizado tridimensional @es

Thrones
type: Class
subclass of: Chairs
comment: A decorative chair used by a king, queen, or emperor on important official occasions.
label: Tronos @es

Tile
type: Class
subclass of: Building elements
comment: A flat, square piece of baked clay, carpet, cork, or other substance, that is fixed as a covering onto a floor or wall.
label: Baldosa @es
alternative label: Azulejo @es

Building timber
type: Class
subclass of: Wooden materials
comment: Wood prepared for use in building, carpentry and furniture.
label: Madera para contrucción @es

Tinting
type: Class
equivalent class: Restriction
  on property: Performed by
  some values from: Class
    union of: Aerographic application robot
    union of: Roller machine
    union of: Spray application gun
subclass of: Finishing
label: Tintado @es

Tissue boxes
type: Class
subclass of: Bathroom accessories
comment: A container, typically made of cardboard or plastic, designed to hold and dispense facial tissues.
label: Cajas de pañuelos @es

Toasters
type: Class
subclass of: Household appliances
comment: A piece of electrical equipment used to toast bread.
label: Tostadoras @es

Toilets
type: Class
subclass of: Bathroom accessories
comment: A large bowl with a seat, or a platform with a hole, which is connected to a water system and used to get rid of urine or faeces from the body.
label: Inodoros @es
alternative label: Sanitarios @es

Toilet brushes
type: Class
subclass of: Bathroom accessories
comment: A brush with a long handle that is used to clean the inside of a toilet.
label: Escobillas de baño @es

Toilet brush holders
type: Class
subclass of: Racks
comment: A device to hold the toilet brush when it is not used.
label: Escobilleros @es
alternative label: Porta escobillas @es

Toilet tanks
type: Class
subclass of: Bathroom accessories
comment: The reservoir located in the back of a water closet that holds the water necessary for flushing away waste.
label: Cisternas WC @es
alternative label: Cisterns

Tools
type: Class
subclass of: Auxiliary equipment
label: Herramientas @es

Tools
type: Class
subclass of: Material supplier
label: Herramientas @es

Toothbrushes
type: Class
subclass of: Bathroom accessories
comment: A small brush used for cleaning the teeth.
label: Cepillos de dientes @es

Toothbrush holders
type: Class
subclass of: Bathroom accessories
comment: A container or rack in a bathroom where toothbrushes are kept when not in use.
label: Portacepillos @es

Topple barriers
type: Class
subclass of: Industrial protection elements
label: Barreras para alturas @es

Towels
type: Class
subclass of: Bath textile
comment: A square or rectangular piece of absorbent cloth or paper used for drying the body.
label: Toallas @es

Towel racks
type: Class
subclass of: Racks
comment: A piece of railing, used to hang towels upon.
label: Toalleros @es
alternative label: Towel rails

Toy box
type: Class
subclass of: Cabinets
comment: A large container for the storage of children's toys.
label: Juguetero @es

Track lighting
type: Class
subclass of: Ceiling lighting
comment: A system consisting of a track, usually fixed to the ceiling or wall, on which different types of lighting fixtures can be installed, removed, and repositioned.
label: Lámparas de carril @es
alternative label: Focos de carril @es

Traffic barriers
type: Class
subclass of: Industrial protection elements
label: Barreras para tráfico de vehículos @es

Trailer plates
type: Class
subclass of: Industrial protection elements
label: Base estabilizadora para trailer @es

Training
type: Class
subclass of: Services
label: Formación @es

Training
type: Class
subclass of: Service provider
label: Formación @es

Transformers
type: Class
subclass of: Household appliances
comment: A device for reducing or increasing the voltage of an electric power supply, usually to allow a particular piece of electrical equipment to be used.
label: Transformadores @es

Transport
type: Class
subclass of: Processes
comment: System or means of conveying people, goods, etc. from place to place.
label: Transporte @es
alternative label: Shipping

Transport
type: Class
subclass of: Logistics services
comment: A service for of taking goods or people from one place to another in a vehicle.
label: Transporte @es
alternative label: Transportation

Transverse flutes
type: Class
subclass of: Flutes
comment: A flute that is played by holding it to the side, like the flute of the modern orchestra. It belongs to the woodwind family because the first flutes that were built were all made of wood.
label: Flautas traveseras @es

Trap doors
type: Class
subclass of: Doors
comment: A door that is oriented horizontally in a floor or ceiling, often accessed via a ladder.
label: Trampillas @es

Travel cribs
type: Class
subclass of: Children furniture
comment: A portable sleeping solution for infants and young children that is designed to be lightweight and easy to transport.
label: Cunas de viaje @es

Trombones
type: Class
subclass of: Brass instruments
comment: A large musical instrument of the brass family. It consists of two long oval tubes, one of which can be pushed backwards and forwards to play different notes.

Trumpets
type: Class
subclass of: Brass instruments
comment: A valved brass instrument of brilliant tone consisting of a narrow tube of cylindrical bore ending in a flared bell.
label: Trompetas @es

Trundle beds
type: Class
subclass of: Beds
comment: A low bed on wheels, stored under a larger bed.
label: Camas nido @es
alternative label: Truckle beds

Truss
type: Class
subclass of: Building elements
comment: A structural element composed of steel or wood bars that interconnect to form triangular structures that form a rigid framework that allows the safe transfer of weight, and is therefore used as a base for building structures.
label: Cercha @es

Tubas
type: Class
subclass of: Brass instruments
comment: A large musical instrument of the brass family which produces very low notes. It consists of a long metal tube folded round several times with a wide opening at the end.

Turntable ladders
type: Class
subclass of: Ladders
comment: A ladder fitted to rotating platform on top of a fire truck.
label: Escaleras mecánicas @es

Ukeleles
type: Class
subclass of: Stringed instruments
comment: A small, guitarlike musical instrument associated especially with Hawaiian music.

Ultraviolet drying
type: Class
subclass of: Techniques
label: Secado por ultravioleta @es

Ultraviolet tunnel for varnished flat pieces
type: Class
equivalent class: Restriction
  on property: Employs
  some values from: Ultraviolet drying
subclass of: Drying tunnel
label: Túnel de ultravioleta para piezas planas barnizadas @es

Umbrellas
type: Class
subclass of: Mixed use accessories
comment: An object used to protect from the rain or hot sun. It consists of a long stick with a folding frame covered in cloth.
label: Parasoles @es

Umbrella stands
type: Class
subclass of: Racks
comment: An upright unit, used for storing umbrellas in an upright/ vertical position.
label: Paragüeros @es

Up and over doors
type: Class
subclass of: Doors
comment: A door that is often used in garages. Instead of hinges it has a mechanism, often counterbalanced or sprung, that allows it to be lifted so that it rests horizontally above the opening.
label: Puertas basculantes @es

Upholstered Furniture
type: Class
subclass of: Manufacturer
label: Mueble Tapizado @es

Upholstering
type: Class
subclass of: Processes
label: Tapizado @es

Upholstery materials
type: Class
subclass of: Materials
comment: The material used to make seats, sofas, etc.
label: Materiales de tapizado @es

UF (urea-formaldehyde)
type: Class
subclass of: Formaldehyde adhesives
label: UF (urea-formaldehído) @es

MUF (urea-melamine-formaldehyde)
type: Class
subclass of: Formaldehyde adhesives
label: MUF (urea-melamina-formaldehído) @es

Valves
type: Class
subclass of: Auxiliary equipment
label: Válvulas @es

Varnishes
type: Class
subclass of: Coating substances
subclass of: Restriction
  on property: Base of substance
  some values from: string
subclass of: Restriction
  on property: Solvent-based
  some values from: boolean
subclass of: Restriction
  on property: Water-based
  some values from: boolean
comment: A liquid that is applied to wood, metal, paintings, etc and forms a hard shiny transparent surface when dry.
label: Barnices @es

Varnishing
type: Class
equivalent class: Restriction
  on property: Performed by
  some values from: Class
    union of: Aerographic application robot
    union of: Curtain coating machine
    union of: Roller machine
    union of: Spray application gun
subclass of: Finishing
comment: This process is done by using a transparent varnish.
label: Barnizado @es

Vases
type: Class
subclass of: Decoration elements
comment: A jar, usually made of glass or pottery, used for holding cut flowers or as an ornament.
label: Jarrones @es

Veneer
type: Class
subclass of: Material supplier
label: Chapa @es

Veneered boards
type: Class
subclass of: Wooden boards
label: Tableros rechapados @es
alternative label: Chapas @es

Vertical band sander
type: Class
subclass of: Manual machines
label: Lijadora de banda vertical @es

Vertical band sander for simple curves
type: Class
subclass of: Manual machines
label: Lijadora de banda vertical para curvas simples @es

Vertical sliding table saw
type: Class
subclass of: Manual machines
label: Escuadradora vertical @es

Vertical sliding table saw with automatic movement
type: Class
subclass of: Semi-automatic machines
label: Escuadradora vertical con movimiento de sierra automático @es

Vertical surfaces
type: Class
subclass of: Components
comment: A flat surface parallel to the ground.
label: Superficies verticales @es

Vessels
type: Class
subclass of: Decoration elements
comment: A bowl or other container in which liquid is kept.
label: Vasijas @es
alternative label: Pots

Vinyl fabric
type: Class
subclass of: Synthetic fabric
label: Tejido de vinilo @es

Violas
type: Class
subclass of: Stringed instruments
comment: A musical instrument with four strings that is played with a bow. It is like a violin, but is slightly larger and can play lower notes.

Violas da gamba
type: Class
subclass of: Stringed instruments
comment: An early stringed instrument of the viol family, held between the knees and comparable in range to the cello.

Violins
type: Class
subclass of: Stringed instruments
comment: A bowed stringed instrument consisting of a fingerboard, a hollow wooden body with waisted sides, and a sounding board connected to the back by means of a soundpost that also supports the bridge.
label: Violines @es
alternative label: Fiddles

Virginales
type: Class
subclass of: Keyboard instruments
comment: A musical instrument with strings and a keyboard similar to the spinet, but generally rectangular in shape and with the strings perpendicular or oblique to the keys, providing a greater timbral richness.

Viscoelastic mattresses
type: Class
subclass of: Mattresses
comment: A mattress that is mainly made of viscoelastic foam, a material that adapts to the shape of the body and distributes weight evenly.
label: Colchones viscoelásticos @es

Viscose rayon fibre
type: Class
subclass of: Natural fibre
label: Fibra de viscosa rayón @es

Viscosity meters
type: Class
subclass of: Measuring instruments
label: Medidores de viscosidad @es
alternative label: Viscosímetros @es

Wadding
type: Class
subclass of: Paddings
comment: La guata es un material textil no tejido fabricado con filamentos de algodón que se usa principalmente como relleno y aislante térmico. @es
comment: The wadding is a non-textile material made with cotton strands, which is mainly used as fill and thermal insulator.
label: Guata @es

Wall cabinets
type: Class
subclass of: Kitchen cabinets
comment: A storage cupboard, usually with shelves, located above the countertop.
label: Módulos altos @es

Wall cladding
type: Class
subclass of: Floorings and coatings
comment: A type of material that is applied to a vertical surface in order to decorate and protect it.
label: Revestimiento de paredes @es

Wall guards
type: Class
subclass of: Industrial protection elements
label: Protectores de pared @es

Walnut wood
type: Class
subclass of: Wood
comment: Tree that has a wood coloured from grey to brown. Its texture is usually smooth. The word is applied, too, to the colour of the walnut.
label: Madera de nogal @es

Wardrobes
type: Class
subclass of: Cabinets
comment: The place where clothes are stored, usually a large cupboard with shelves and a rail for hanging things on.
label: Armarios roperos @es

Warehousing
type: Class
subclass of: Logistics services
comment: A service consisting of storing large quantities of goods so that they can be sold or used at a later date.
label: Servicios de almacenaje @es

Washers
type: Class
subclass of: Basic assembly hardware
subclass of: Restriction
  on property: Washer type
  some values from: string
comment: A small flat ring made of rubber, metal or plastic placed between two surfaces, for example under a nut to make a connection tight.
label: Arandelas @es

Washstands
type: Class
subclass of: Mixed use accessories
comment: A special table in a bedroom that holds a basin and jug for washing oneself with.
label: Lavabos @es
alternative label: Palanganas @es
alternative label: Washbasins

Waste containers
type: Class
subclass of: Furniture accessories
comment: A receptacle to store waste.
label: Recipientes de desechos @es

Waste management
type: Class
subclass of: Services
label: Gestión de residuos @es

Waste Management
type: Class
subclass of: Service provider
label: Gestión de Residuos @es

Wastepaper baskets
type: Class
subclass of: Waste containers
comment: A container for rubbish, especially paper, which is usually placed on the floor in the corner of a room or next to a desk.
label: Papeleras @es
alternative label: Wastebaskets

Water beds
type: Class
subclass of: Beds
comment: A bed/mattress combination where the mattress is filled with water. It includes a heavy-duty frame built specifically to support the weight of the water in the mattress.
label: Camas de agua @es

Water heaters
type: Class
subclass of: Household appliances
comment: A container in which water is heated to provide hot water and heating in a building or to produce steam in an engine.
label: Calentadores @es
alternative label: Boilers

Water mattresses
type: Class
subclass of: Mattresses
comment: A mattress in the form of a closed rubber bag filled with water.
label: Colchones de agua @es
alternative label: Waterbeds

Weighing scales
type: Class
subclass of: Bathroom accessories
comment: A device used to measure weight.
label: Básculas @es
alternative label: Scales

Welding
type: Class
equivalent class: Restriction
  on property: Performed by
  some values from: Class
    union of: Welding machine
    union of: Welding robot
subclass of: Assembly
label: Soldadura @es

Welding machine
type: Class
subclass of: Manual machines
label: Soldadora @es

Welding robot
type: Class
subclass of: Robots
label: Robot soldadora @es

Wheel chairs
type: Class
subclass of: Chairs
comment: A special chair mounted on large wheels, for use by people with disabilities or others for whom walking is impossible or temporarily inadvisable.
label: Sillas de ruedas @es

Wheel stops
type: Class
subclass of: Industrial protection elements
label: Topes de rueda @es

Whiteboards
type: Class
subclass of: Writing boards
comment: Any glossy surface, most commonly coloured white, where markings can be made. Whiteboards operate analogously to chalkboards in that they allow markings to temporarily adhere to the surface of the board.
label: Pizarras rotulables @es
alternative label: Dry-erase boards
alternative label: Dry-wipe boards

Wide cutting of plates
type: Class
equivalent class: Restriction
  on property: Performed by
  some values from: Class
    union of: Guillotine with parallelogram and digital control
    union of: Guillotine with single edge and spliting piston
subclass of: Quartering
label: Corte ancho paquete de chapas @es

Wind instruments
type: Class
subclass of: Musical instruments
comment: A musical instrument sounded by the breath, such as the woodwinds and brass instruments of an orchestra.
label: Instrumentos de viento @es

Windows
type: Class
subclass of: Pieces of furniture
comment: An opening in a wall or roof of a building, car, etc. that has glass in it so that light can pass through.
label: Ventanas @es

Window frames
type: Class
subclass of: Frames
comment: A frame around the edges of a window, which glass is fixed into.
label: Marcos de ventana @es

Wine racks
type: Class
subclass of: Racks
comment: A piece of furniture, usually a cupboard, to store drinks.
label: Botelleros @es
alternative label: Cocktail cabinets

Wingchairs
type: Class
subclass of: Domestic chairs
comment: An armchair with small wings or ears at both sides of the head line.
label: Sillones orejeros @es

Wood
type: Class
subclass of: Wooden materials
comment: The hard material that the trunk and branches of a tree are made of.
label: Madera @es

Wood
type: Class
subclass of: Material supplier
label: Madera @es

Wood veneers
type: Class
subclass of: Wooden materials
comment: A thin layer of wood glued to the surface of a lower quality wood or panel material.
label: Chapas de madera @es

Wooden boards
type: Class
subclass of: Wooden materials
subclass of: Restriction
  on property: Coated
  some values from: boolean
subclass of: Restriction
  on property: Type of coating
  some values from: string
comment: A long thin flat piece of a hard material, specially cut wood.
label: Tableros de madera @es

Wooden materials
type: Class
subclass of: Materials
subclass of: Restriction
  on property: Wood species
  some values from: string
label: Madera y derivados @es

Wooden Packaging
type: Class
subclass of: Manufacturer
label: Embalaje de Madera @es

Board for wooden structures
type: Class
subclass of: Wooden boards
label: Tableros estructurales @es

Wooden Structures
type: Class
subclass of: Manufacturer
label: Estructuras de Madera @es

Woodwind instruments
type: Class
subclass of: Wind instruments
comment: A musical instrument that is played by blowing through different types of mouthpieces and is constructed of wood (although there are some exceptions such as the transverse flute and the saxophone).
label: Instrumentos de viento-madera @es

Wool fibre
type: Class
subclass of: Natural fibre
label: Fibra de lana @es

Work tables
type: Class
subclass of: Tables
comment: A table for holding working materials and implements.
label: Mesas de trabajo @es

Workbenches
type: Class
subclass of: Work tables
comment: A table used in woodworking, metalworking, and other trades upon which work of a specific nature may take place. The workbench may be any size, but is normally a rectangular shape. Workbenches often have vices attached to them for wood workers. Woodworking benches also make use of dog holes and bench dogs, which are used in clamping operations or as stops for work to butt up against.
label: Bancos de trabajo @es

Wrenches
type: Class
subclass of: Tools
comment: A wrench is a tool used to provide grip and mechanical advantage in applying torque to turn objects such as nuts and bolts or keep them from turning.
comment: Una llave inglesa es una herramienta utilizada para proporcionar agarre y fuerza mecánica aplicando torsión para girar elementos como tuercas y pernos o apretarlos. @es
comment: Wrenches are usually used for guns.
label: Llaves inglesas @es
alternative label: Spanners

Writing boards
type: Class
subclass of: Table tops
comment: A smooth vertical surface to be written upon using an erasable material , large enough for several persons to read simultaneously.
label: Tableros para escribir @es

Writing desks
type: Class
subclass of: Office tables
comment: A desk with drawers, shelves and usually a sloping lid which forms a writing surface when open.
label: Escritorios @es
alternative label: Bureau
alternative label: Burós @es
alternative label: Roll-top desks
alternative label: Writing tables

Xylophones
type: Class
subclass of: Percussion instruments
comment: ​A musical instrument made of two rows of wooden bars of different lengths that are hitted with two small sticks.
label: Xilófonos @es

Youth bedroom
type: Class
subclass of: Furniture compositions
comment: A combination of furniture items to furnish a room used by young people for sleeping in it.
label: Dormitorio juvenil @es

Zamak
type: Class
subclass of: Metal materials

Zip-lines
type: Class
subclass of: Playground equipment
comment: A system of ropes or cables laid at height between two ends, which, by means of a pulley and a harness, allows one to slide along them using the force of gravity.
comment: Un sistema de cuerdas o cables tendidos en altura entre dos extremos, que mediante una polea y un arnés permite deslizarse por ellos usando la fuerza de la gravedad. @es
label: Tirolinas @es
alternative label: Sky riders

Zithers
type: Class
subclass of: Stringed instruments
comment: A plucked musical instrument consisting of numerous strings stretched over a resonating box, a few of which may be stopped on a fretted fingerboard.
label: Cítaras @es

AdherenceUnitList
type: NamedIndividual
type: UnitList
has code: MPa
has code: N/mm2
id: AdherenceUnitListId

AirLoadList
type: NamedIndividual
type: CodeList
has code: Medium-big package transport
has code: Pallet transport
id: AirLoadListId

Automotive
type: NamedIndividual
type: CodeType
has code: AutomotiveIndustrySpecializationOption
label: Automoción @es

AuxiliarUse
type: NamedIndividual
type: CodeType
has code: AuxiliarUse
label: Auxiliar @es

Baroque
type: NamedIndividual
type: CodeType
has code: BaroqueStyle
label: Barroco @es

Bathroom
type: NamedIndividual
type: CodeType
has code: BathroomUse
label: Baño @es

BeamMaterialList
type: NamedIndividual
type: CodeList
has code: Steel
has code: Wood
id: BeamMaterialListId

Border control inspection handling
type: NamedIndividual
type: CodeType
has code: BorderControlInspectionHandlingService
label: Gestión de inspecciones de control aduanero @es

Box
type: NamedIndividual
type: CodeType
has code: BoxContainerType
label: Caja @es

Box-small packages
type: NamedIndividual
type: CodeType
has code: BoxSmallPackagesProductType
label: Cajas-paquetes pequeños @es

Bulk cargo
type: NamedIndividual
type: CodeType
has code: BulkCargoProductType
label: Carga a granel @es

Cage
type: NamedIndividual
type: CodeType
has code: CageContainerType
label: Jaula @es

Cardboard
type: NamedIndividual
type: CodeType
has code: CardboardMaterialOption
label: Cartón @es

CardboardTypeList
type: NamedIndividual
type: CodeList
has code: Double-double-faced
has code: Double-faced
has code: Single-faced
has code: Triple-faced
id: CardboardTypeListId

CardboardWaveTypeList
type: NamedIndividual
type: CodeList
has code: A
has code: B
has code: C
has code: D
id: CardboardWaveTypeListId
label: Combination

Ceramic
type: NamedIndividual
type: CodeType
has code: CeramicIndustrySpecializationOption
label: Cerámica @es

Child bedroom
type: NamedIndividual
type: CodeType
has code: ChildBedroomUse
label: Dormitorio infantil @es

Children change
type: NamedIndividual
type: CodeType
has code: ChildrenChangeUse
label: Cambio de pañales @es

Children play
type: NamedIndividual
type: CodeType
has code: ChildrenPlayUse
label: Juegos infantiles @es

Children sleep
type: NamedIndividual
type: CodeType
has code: ChildrenSleepUse
label: Descanso infantil @es

Children transport
type: NamedIndividual
type: CodeType
has code: ChildrenTransportUse
label: Transporte infantil @es

Chipboard
type: NamedIndividual
type: CodeType
has code: ChipboardMaterialOption
label: Madera aglomerada @es

Classic
type: NamedIndividual
type: CodeType
has code: ClassicStyle
label: Clásico @es

Classification operations
type: NamedIndividual
type: CodeType
has code: ClassificationOperationsService
label: Operaciones de clasificación @es

Coil
type: NamedIndividual
type: CodeType
has code: CoilProductType
label: Bobina @es

Colonial
type: NamedIndividual
type: CodeType
has code: ColonialStyle

Compact cardboard
type: NamedIndividual
type: CodeType
has code: CompactCardboardMaterialOption
label: Cartón compacto @es

Construction
type: NamedIndividual
type: CodeType
has code: ConstructionIndustrySpecializationOption
label: Construcción @es

ContainerMaterialList
type: NamedIndividual
type: CodeList
has code: Metal
has code: Plastic
has code: Wood
id: ContainerMaterialListId

ContainerTypeList
type: NamedIndividual
type: CodeList
has code: Box
has code: Cage
has code: Racks
has code: Supporting laterals
id: ContainerTypeListId

Contemporary
type: NamedIndividual
type: CodeType
has code: ContemporaryStyle
label: Contemporáneo @es

CornerPieceMaterialList
type: NamedIndividual
type: CodeList
has code: Cardboard
has code: Compact cardboard
has code: EPS (expanded polystyrene)
has code: Honeycomb
has code: Polyurethane foam
has code: PVC (polyvinyl chloride)
id: cornerPieceMaterialListId

CornerPieceShapeList
type: NamedIndividual
type: CodeList
has code: Corner
has code: L
has code: U
id: CornerPieceShapeListId

Cross docking
type: NamedIndividual
type: CodeType
has code: CrossDocking

Customer train
type: NamedIndividual
type: CodeType
has code: CustomerTrainRailLoad
comment: El cliente utiliza todos los vagones del tren. @es
comment: The customer contracts all the coaches of the train.
label: Tren dedicado @es

Customs declaration
type: NamedIndividual
type: CodeType
has code: CustomsDeclarationService
label: Declaración de aduana @es

CustomsManagementServiceList
type: NamedIndividual
type: CodeList
has code: Border control inspection handling
has code: Customs declaration
has code: Customs warehousing dispatching
id: CustomsManagementServiceListId

Customs warehousing dispatching
type: NamedIndividual
type: CodeType
has code: CustomsWarehousingDispatchingService
label: Depósito aduanero @es

Delivery operations
type: NamedIndividual
type: CodeType
has code: DeliveryOperationsService
label: Operaciones de entrega @es

DeliveryTimeUnitList
type: NamedIndividual
type: UnitList
has code: day
has code: hour
has code: month
has code: week
id: DeliveryTimeUnitListId

DensityUnitList
type: NamedIndividual
type: UnitList
has code: kg/m3
has code: lb/ft3
id: DensityUnitListId

Deposit
type: NamedIndividual
type: CodeType
has code: DepositService
label: Depósito @es

DesignStyle
type: NamedIndividual
type: CodeType
label: Design
label: Diseño @es

Dining room
type: NamedIndividual
type: CodeType
has code: Dining-roomUse
label: Comedor @es

Direct shipment
type: NamedIndividual
type: CodeType
has code: DirectShipment
label: Transporte directo @es

Disabled people
type: NamedIndividual
type: CodeType
has code: DisabledUse
label: Discapacitados @es

Door to door
type: NamedIndividual
type: CodeType
has code: DoorToDoor

Double bedroom
type: NamedIndividual
type: CodeType
has code: DoubleBedroomUse
label: Dormitorio doble @es

Double-double-faced
type: NamedIndividual
type: CodeType
has code: DoubleDoubleFacedCardboardType
label: Doble-doble cara @es

Double-faced
type: NamedIndividual
type: CodeType
has code: DoubleFacedCardboardType
label: Doble cara @es

Double
type: NamedIndividual
type: CodeType
has code: DoublePalletFlatType
label: Doble @es

Drop shipping
type: NamedIndividual
type: CodeType
has code: DropShipping
label: Transporte triangular @es

Energy
type: NamedIndividual
type: UnitList
has code: J
id: EnergyUnitListId
label: Energía @es

Europallet (800 x 1200 mm)
type: NamedIndividual
type: CodeType
has code: EuropalletDimensions
label: Europalet (800 x 1200 mm) @es

EPS (expanded polystyrene)
type: NamedIndividual
type: CodeType
has code: ExpandedPolystyreneMaterialOption
label: EPS (poliestireno expandido) @es

Expiration-obsolescence control
type: NamedIndividual
type: CodeType
has code: ExpirationControlService
label: Control de expiración-obsolescencia @es

FefcoClassificationList
type: NamedIndividual
type: CodeList
has code: 01 Coil, press
has code: 02 Flap
has code: 03 Telescopic
has code: 04 Foldable or tray
has code: 05 Sliding type
has code: 06 Rigid type
has code: 07 Gluing
has code: 09 Interior construction
id: FefcoClassificationListId

01 Coil, press
type: NamedIndividual
type: CodeType
has code: FefcoCode01
label: 01 Bobina, plancha @es

02 Flap
type: NamedIndividual
type: CodeType
has code: FefcoCode02
label: 02 Solapa @es

03 Telescopic
type: NamedIndividual
type: CodeType
has code: FefcoCode03
label: 03 Telescópica @es

04 Foldable or tray
type: NamedIndividual
type: CodeType
has code: FefcoCode04
label: 04 Plegable o bandeja @es

05 Sliding type
type: NamedIndividual
type: CodeType
has code: FefcoCode05
label: 05 Tipo deslizante @es

06 Rigid type
type: NamedIndividual
type: CodeType
has code: FefcoCode06
label: 06 Tipo rígido @es

07 Gluing
type: NamedIndividual
type: CodeType
has code: FefcoCode07
label: 07 Encolada @es

09 Interior construction
type: NamedIndividual
type: CodeType
has code: FefcoCode09
label: 09 Acondicionamiento interior @es

FlooringAndCoatingMaterialList
type: NamedIndividual
type: CodeList
has code: Gravel
has code: Baldosa
has code: Wood
has code: Wood veneer
id: FlooringAndCoatingMaterialListId

Food
type: NamedIndividual
type: CodeType
has code: FoodIndustrySpecializationOption
label: Alimentación @es

Footwear
type: NamedIndividual
type: CodeType
has code: FootwearIndustrySpecializationOption
label: Calzado @es

Full container
type: NamedIndividual
type: CodeType
has code: FullContainerMaritimeLoad
label: Contenedor completo @es

FTL-Full truck load
type: NamedIndividual
type: CodeType
has code: FullTruckLoad
label: FTL-Carga completa @es

Gimnasium and leisure
type: NamedIndividual
type: CodeType
has code: GimnasiumAndLeisureUse
label: Deporte y entretenimiento @es

Globito White
type: NamedIndividual
type: Cradles
Manufactured by: Micuna SL
Adjustable height: false
Description: An original design that combines straight lines of the side rails with a rounded head board on this cradle of 120 x 60. Robust but with a light aspect at the same time, it is ideal for the sleep of the youngest.
EAN code: 8431830130773
Has folding side: true
Name: Globito White
Number of castors: 4
Co-sleeping convertible: true
Foldable: false

GlossUnitList
type: NamedIndividual
type: UnitList
has code: gu
id: GlossUnitListIdId

Gravel
type: NamedIndividual
type: CodeType
has code: GravelMaterialOption
label: Gravilla @es

Groupage
type: NamedIndividual
type: CodeType
has code: GroupageMaritimeLoad
label: Grupaje @es

Groupage
type: NamedIndividual
type: CodeType
has code: GroupageTruckLoad
label: Grupaje @es

GuaranteePeriodUnitList
type: NamedIndividual
type: UnitList
has code: day
has code: month
has code: week
has code: year
id: GuaranteePeriodUnitListId

Half pallet (600 x 800 mm)
type: NamedIndividual
type: CodeType
has code: HalfPalletDimensions
label: Media paleta (600 x 800 mm) @es

Hall
type: NamedIndividual
type: CodeType
has code: HallUse
label: Recibidor @es

Hazardous goods
type: NamedIndividual
type: CodeType
has code: HazardousGoodsProductType
label: Mercancías peligrosas @es

HeightUnitList
type: NamedIndividual
type: UnitList
has code: cm
has code: m
has code: mm
id: HeightUnitListId

Honeycomb
type: NamedIndividual
type: CodeType
has code: HoneycombMaterialOption
label: Nido de abeja @es

Hospitals
type: NamedIndividual
type: CodeType
has code: HospitalsUse
label: Hospitales @es

Hotels
type: NamedIndividual
type: CodeType
has code: HotelsUse
label: Hoteles @es

InHouseServiceList
type: NamedIndividual
type: CodeList
has code: Classification operations
has code: Delivery operations
has code: Packaging operations
has code: Picking operations
has code: Reception operations
has code: Storage operations
id: InHouseServiceListId

IndustrySpecializationList
type: NamedIndividual
type: CodeList
has code: Automotive
has code: Ceramic
has code: Construction
has code: Food
has code: Footwear
has code: Retail
has code: Textile
has code: Toy
has code: Wood-furniture
id: IndustrySpecializationListId

Inventory control
type: NamedIndividual
type: CodeType
has code: InventoryControlService
label: Control de inventario @es

Inventory management
type: NamedIndividual
type: CodeType
has code: InventoryManagementService
label: Gestión de inventario @es

Kitchen
type: NamedIndividual
type: CodeType
has code: KitchenUse
label: Cocina @es

Labelling
type: NamedIndividual
type: CodeType
has code: LabellingService
label: Etiquetado @es

Laboratory
type: NamedIndividual
type: CodeType
has code: LaboratoryUse
label: Laboratorio @es

LengthUnitList
type: NamedIndividual
type: UnitList
has code: cm
has code: m
has code: mm
id: LengthUnitListId

Liquids
type: NamedIndividual
type: CodeType
has code: LiquidsProductType
label: Líquidos @es

LogisticsConsultancyServiceList
type: NamedIndividual
type: CodeList
has code: Manufacturing processes
has code: Packaging processes
has code: Supply chain management
has code: Transportation processes
has code: Warehousing processes
id: LogisticsConsultancyServiceListId

Lounge
type: NamedIndividual
type: CodeType
has code: LoungeUse
label: Salón @es

MDF Board 11190914
type: NamedIndividual
type: MDF boards
Code: 11190914
Name: MDF Board 11190914
Certifications: PEFC
Fireproof: false
Waterproof: false

MDF Board 138495
type: NamedIndividual
type: MDF boards
Code: 138495
Name: MDF Board 138495
Certifications: PEFC
Fireproof: false
Waterproof: false

ManagedProductTypeList
type: NamedIndividual
type: CodeList
has code: Box-small packages
has code: Bulk cargo
has code: Coil
has code: Hazardous goods
has code: Liquids
has code: Medium-big packages
has code: Pallets
has code: Perishable
has code: Stackable products
id: ManagedProductTypeListId

Manufacturing processes
type: NamedIndividual
type: CodeType
has code: ManufacturingProcessesService
label: Procesos de fabricación @es

MaritimeLoadList
type: NamedIndividual
type: CodeList
has code: Full container
has code: Groupage
id: MaritimeLoadList

Medium-big packages
type: NamedIndividual
type: CodeType
has code: MediumBigPackagesProductType
label: Contenedores (medio-gran tamaño) @es

Medium-big package transport
type: NamedIndividual
type: CodeType
has code: MediumBigPackageTransportAirLoad
label: Transporte de contenedores (medio-gran tamaño) @es

Metal
type: NamedIndividual
type: CodeType
has code: MetalMaterialOption

Micuna Collection 2017
type: NamedIndividual
type: Catalogue
Catalogue name: Micuna Collection 2017

Micuna Nova
type: NamedIndividual
type: Cradles
Manufactured by: Micuna SL
Name: Micuna Nova
Number of castors: 4

Micuna SL
type: NamedIndividual
type: Manufacturer
Has catalogue: Micuna Collection 2017
Company name: Micuna S.L.

Micuna Wonderful
type: NamedIndividual
type: Cradles
Manufactured by: Micuna SL
Name: Micuna Wonderful
Number of castors: 4

Minimalist
type: NamedIndividual
type: CodeType
has code: MinimalistStyle
label: Minimalista @es

Modern
type: NamedIndividual
type: CodeType
has code: ModernStyle
label: Moderno @es

Money refund to customer
type: NamedIndividual
type: CodeType
has code: MoneyRefundToCustomerService
label: Reembolso de dinero al cliente @es

Multi-train
type: NamedIndividual
type: CodeType
has code: MultiTrainRailLoad
comment: El tren es compartido por varios clientes, con al menos un vagón por cliente. @es
comment: The train is shared by several customers, with at least one coach per customer.
label: Multi-cliente @es

Nicole White
type: NamedIndividual
type: Cradles
Manufactured by: Micuna SL
Adjustable height: false
Description: Nicole is a classic and elegant cradle, which remains current with the passage of time. Available in four colours of wood: white, honey, natural and chocolate. Optional drawer.
EAN code: 8431830103692
Has folding side: true
Name: Nicole White
Number of castors: 4
Co-sleeping convertible: false
Foldable: false

Office
type: NamedIndividual
type: CodeType
has code: OfficeUse
label: Oficina @es

OrderPickingServiceList
type: NamedIndividual
type: CodeList
has code: Labelling
has code: Order preparation
has code: Packaging
has code: Replenishment of order
id: OrderPickingServiceListId

Order preparation
type: NamedIndividual
type: CodeType
has code: OrderPreparationService
label: Preparación de pedidos @es

Outdoors
type: NamedIndividual
type: CodeType
has code: OutdoorsUse
label: Exteriores @es

Ovo Plus City
type: NamedIndividual
type: High chairs
Manufactured by: Micuna SL
Adjustable height: false
Description: Highchair in grey and mahogany colour with fabric grey belts and fixed tray included. It can be convertible to chair.
EAN code: 8431830137260
Name: Ovo Plus City
Number of legs: 4
Seat belt: true
Foldable: false

Packaging operations
type: NamedIndividual
type: CodeType
has code: PackagingOperationsService
label: Operaciones de embalaje @es

Packaging processes
type: NamedIndividual
type: CodeType
has code: PackagingProcessesService
label: Procesos de embalaje @es

Packaging
type: NamedIndividual
type: CodeType
has code: PackagingService
label: Embalaje @es

PalletDimensionsList
type: NamedIndividual
type: CodeList
has code: Europallet (800 x 1200 mm)
has code: Half pallet (600 x 800 mm)
has code: Quarter pallet (600 x 400 mm)
has code: Universal / American (1000 x 1200 mm)
id: PalletDimensionsListId

PalletFlatTypeList
type: NamedIndividual
type: CodeList
has code: Double
has code: Simple
id: PalletFlatTypeListId

PalletMaterialList
type: NamedIndividual
type: CodeList
has code: Cardboard
has code: Chipboard
has code: Metal
has code: Plastic
has code: Wood
id: PalletMaterialListId

Pallets
type: NamedIndividual
type: CodeType
has code: PalletsProductType

Pallet transport
type: NamedIndividual
type: CodeType
has code: PalletTransportAirLoad
label: Transporte de pallets @es

PTL-Partial truck load
type: NamedIndividual
type: CodeType
has code: PartialTruckLoad
label: Carga parcial @es

Perishable
type: NamedIndividual
type: CodeType
has code: PerishableProductType
label: Productos perecederos @es

Picking operations
type: NamedIndividual
type: CodeType
has code: PickingOperationsService
label: Operaciones de recogida @es

Plastic
type: NamedIndividual
type: CodeType
has code: PlasticMaterialOption
label: Plástico @es

Polyurethane foam
type: NamedIndividual
type: CodeType
has code: PolyurethaneFoamMaterialOption
label: Espuma de poliuretano @es

PVC (polyvinyl chloride)
type: NamedIndividual
type: CodeType
has code: PolyvinylChlorideMaterialOption
label: PVC (policloruro de vinilo) @es

Product disassembly
type: NamedIndividual
type: CodeType
has code: ProductDisassemblyService
label: Desmontaje de producto @es

Professional
type: NamedIndividual
type: CodeType
has code: ProfessionalUse
label: Profesional @es

ProtectivePlateMaterialList
type: NamedIndividual
type: CodeList
has code: Cardboard
has code: EPS (expanded polystyrene)
has code: Honeycomb
has code: Polyurethane foam
id: ProtectivePlateMaterialListId

Quarter pallet (600 x 400 mm)
type: NamedIndividual
type: CodeType
has code: QuarterPalletDimensions
label: Cuarto paleta (600 x 400 mm) @es

Racks
type: NamedIndividual
type: CodeType
has code: RacksContainerType

RailLoadList
type: NamedIndividual
type: CodeList
has code: Customer train
has code: Multi-train
has code: Slot
id: RailLoadListId

Reception operations
type: NamedIndividual
type: CodeType
has code: ReceptionOperationsService
label: Operaciones de recepción @es

Religious
type: NamedIndividual
type: CodeType
has code: ReligiousUse
label: Religioso @es

Replenishment of order
type: NamedIndividual
type: CodeType
has code: ReplenishmentOfOrderService
label: Reposición de pedido @es

ResistivityUnitList
type: NamedIndividual
type: UnitList
has code: Ω·m
id: ResistivityUnitListId

Restaurant and bar
type: NamedIndividual
type: CodeType
has code: RestaurantAndBarUse
label: Bares y restaurantes @es

Retail
type: NamedIndividual
type: CodeType
has code: RetailIndustrySpecializationOption
label: Minorista @es

ReverseLogisticsServiceList
type: NamedIndividual
type: CodeList
has code: Money refund to customer
has code: Product disassembly
has code: Reverse packaging-unit load transport
has code: Reverse product transport
id: ReverseLogisticsServiceListId

Reverse packaging-unit load transport
type: NamedIndividual
type: CodeType
has code: ReversePackagingTransportService
label: Transporte inverso de unidades de carga (pallets o contenedores vacíos) @es

Reverse product transport
type: NamedIndividual
type: CodeType
has code: ReverseProductTransportService
label: Transporte inverso de producto @es

Rustic
type: NamedIndividual
type: CodeType
has code: RusticStyle
label: Rústico @es

Sabana Honey
type: NamedIndividual
type: Cradles
Manufactured by: Micuna SL
Adjustable height: false
Description: This funny giraffe accompanies the dreams of the most adventurous babies in the Sabana cot, available in white, honey, natural and chocolate. Drawer and matching textile available.
EAN code: 8431830110904
Has folding side: true
Name: Sabana Honey
Number of castors: 4
Co-sleeping convertible: false
Foldable: false

School
type: NamedIndividual
type: CodeType
has code: SchoolUse
label: Escolar @es

Corner
type: NamedIndividual
type: CodeType
has code: ShapeCornerOption
label: Esquina @es

L
type: NamedIndividual
type: CodeType
has code: ShapeLOption

U
type: NamedIndividual
type: CodeType
has code: ShapeUOption

ShipmentTypeList
type: NamedIndividual
type: CodeList
has code: Cross docking
has code: Direct shipment
has code: Door to door
has code: Drop shipping
id: ShipmentTypeListId

Simple
type: NamedIndividual
type: CodeType
has code: SimplePalletFlatType

Single bedroom
type: NamedIndividual
type: CodeType
has code: SingleBedroomUse
label: Dormitorio individual @es

Single-faced
type: NamedIndividual
type: CodeType
has code: SingleFacedCardboardType
label: Simple cara @es

Slot
type: NamedIndividual
type: CodeType
has code: SlotRailLoad
label: Lote @es

Stackable products
type: NamedIndividual
type: CodeType
has code: StackableProductType
label: Productos apilables @es

Steel
type: NamedIndividual
type: CodeType
has code: SteelMaterialOption
label: Acero @es

Storage operations
type: NamedIndividual
type: CodeType
has code: StorageOperationsService
label: Operaciones de almacenamiento @es

Study or office home
type: NamedIndividual
type: CodeType
has code: StudyOrOfficeHomeUse
label: Estudio u oficina en casa @es

StyleList
type: NamedIndividual
type: CodeList
code: Baroque
code: Colonial
code: Contemporary
code: DesignStyle
code: Minimalist
code: Modern
code: Rustic
code: Vintage
id: StyleListId

Supply chain management
type: NamedIndividual
type: CodeType
has code: SupplyChainManagementService
label: Gestión de la cadena de suministro @es

Supporting laterals
type: NamedIndividual
type: CodeType
has code: SupportingLateralsContainerType
label: Laterales de apoyo @es

T950 Plus Natural
type: NamedIndividual
type: High chairs
Manufactured by: Micuna SL
Adjustable height: false
Description: Beech wood highchair with ABS tray, firm screw grip and sliding through a metallic guide.
EAN code: 8431830111260
Name: T-950 Plus Natural
Seat belt: false
Foldable: false

Terrace or garden
type: NamedIndividual
type: CodeType
has code: TerraceOrGardenUse
label: Terraza o jardin @es

Textile
type: NamedIndividual
type: CodeType
has code: TextileIndustrySpecializationOption
label: Textil @es

Baldosa
type: NamedIndividual
type: CodeType
has code: TileMaterialOption
label: Tile

Toy
type: NamedIndividual
type: CodeType
has code: ToyIndustrySpecializationOption
label: Juguete @es

TransportPlaceList
type: NamedIndividual
type: CodeList
id: TransportPlaceListId
comment: Esta lista representa los lugares de origen y destino de un servicio de transporte, y se mantiene vacía. Los códigos correspondientes dependen de la interfaz de usuario. @es
comment: This list represents the places of origin and destination of a transport service, and remains empty. The corresponding codes as options rely on the user interface.

Transportation processes
type: NamedIndividual
type: CodeType
has code: TransportationProcessesService
label: Procesos de transporte @es

Triple-faced
type: NamedIndividual
type: CodeType
has code: TripleFacedCardboardType
label: Triple cara @es

TruckLoadList
type: NamedIndividual
type: CodeList
has code: FTL-Full truck load
has code: Groupage
has code: PTL-Partial truck load
id: TruckLoadListId

Universal / American (1000 x 1200 mm)
type: NamedIndividual
type: CodeType
has code: UniversalAmericanDimensions
label: Universal / Americano (1000 x 1200 mm) @es

Upholstered
type: NamedIndividual
type: CodeType
has code: UpholsteredUse
label: Tapizado @es

Urban furniture
type: NamedIndividual
type: CodeType
has code: UrbanFurnitureUse
label: Mueble urbano @es

UseList
type: NamedIndividual
type: CodeList
code: AuxiliarUse
code: Bathroom
code: Child bedroom
code: Children change
code: Children play
code: Children sleep
code: Children transport
code: Dining room
code: Disabled people
code: Double bedroom
code: Gimnasium and leisure
code: Hall
code: Hospitals
code: Hotels
code: Kitchen
code: Laboratory
code: Lounge
code: Office
code: Outdoors
code: Professional
code: Religious
code: Restaurant and bar
code: School
code: Single bedroom
code: Study or office home
code: Terrace or garden
code: Upholstered
code: Urban furniture
code: Youth bedroom
id: UseListId

Varnish BS2D0
type: NamedIndividual
type: Varnishes
Description: Water base clear fireproof varnish certified in Reaction to fire BS2D0, for varnishing boards for floor and ceiling coatings.
Fireproof: true

Varnish CS2D0
type: NamedIndividual
type: Varnishes
Description: Polyurethane base transparency process certified in Reaction to fire CS2D0, to protect wood against fire.
Fireproof: true

Vintage
type: NamedIndividual
type: CodeType
has code: VintageStyle

ViscosityUnitList
type: NamedIndividual
type: UnitList
has code: Pa
has code: cps
id: ViscosityUnitListId

Warehousing processes
type: NamedIndividual
type: CodeType
has code: WarehousingProcessesService
label: Procesos de almacenaje @es

WarehousingServiceList
type: NamedIndividual
type: CodeList
has code: Deposit
has code: Expiration-obsolescence control
has code: Inventory control
has code: Inventory management
id: WarehousingServiceListId

A
type: NamedIndividual
type: CodeType
has code: WaveTypeA

B
type: NamedIndividual
type: CodeType
has code: WaveTypeB

C
type: NamedIndividual
type: CodeType
has code: WaveTypeC

Combination
type: NamedIndividual
type: CodeType
has code: WaveTypeCombination
label: Combinación @es

D
type: NamedIndividual
type: CodeType
has code: WaveTypeD

WeightUnitList
type: NamedIndividual
type: UnitList
has code: g
has code: gm2
has code: kg
has code: lbs
has code: mg
id: WeightUnitListId

WidthUnitList
type: NamedIndividual
type: UnitList
has code: cm
has code: m
has code: mm
id: WidthUnitListId

Wood-furniture
type: NamedIndividual
type: CodeType
has code: WoodAndFurnitureIndustrySpecializationOption
label: Madera-mueble @es

Wood
type: NamedIndividual
type: CodeType
has code: WoodMaterialOption
label: Madera @es

Wood veneer
type: NamedIndividual
type: CodeType
has code: WoodVeneerMaterialOption
label: Chapa de madera @es

Youth bedroom
type: NamedIndividual
type: CodeType
has code: YouthBedroomUse
label: Dormitorio juvenil @es